{"text_format":"1","workbook":"xlsx","n_sheets":8,"sheets":["fixation on confirm_1","INTRO","MASTER","ORDER","DATA ENTRY","ARREAR","control","7th pay chart"],"not_rendered":{"charts":0,"images":16,"macros":1,"external_links":2,"defined_names":61,"comments":3,"pivot_tables":0},"unopened":[],"bounds":{"document_bytes":16777216,"sheet_cells":100000,"rows_first":2000,"rows_last":500,"rows_between":2000,"halvings":0,"cell_chars":16384,"cell_head_chars":4096},"cells_cut":0,"cells_raw":0,"read":"whole","date_system":"1900"}

{"sheet":"fixation on confirm_1","index":0,"n_rows":51,"n_cols":50,"rows_kept":51,"cut":false,"hidden":true,"merged":[[26,7,26,9],[25,7,25,9],[4,11,4,12],[4,13,4,44],[24,7,24,9],[8,11,12,12],[6,11,7,12],[5,11,5,13],[29,1,29,5],[30,4,33,5],[30,1,34,2],[34,3,34,5],[27,0,27,10],[28,7,28,8],[0,0,0,10],[14,7,14,9],[15,7,15,9],[16,7,16,9],[17,0,17,1],[2,0,2,10],[3,0,4,10],[5,2,6,2],[5,1,6,1],[5,0,6,0],[5,10,6,10],[5,5,6,5],[5,6,5,9],[5,4,6,4],[5,3,6,3]]}
[{"$f":"N5","v":"dk;kZy; iz/kkukpk;Z jktdh; mPp ek/;fed fo|ky; 13 Mhvks,y Jhxaxkuxj"}]
[null,"dzekad",null,null,null,null,null,null,"fnukad"]
["dk;kZy; vkns'k"]
["Jheku la;qDr funs'kd ----------------------------------------------------- ds vkns'k Øekad%& --------------------------- fnukad%& ------------------------ dh vuqikyuk esa bl fo|ky; esa dk;Zjr fuEukafdr dkfeZd dk ofj\"B v/;kid ds in ij dkWye 5 esa vafdr dk;Zxzg.k djus dh fnukad ls nks o\"kZ dh ifjoh{kk/khu izf'k{k.kkFkhZ dh vof/k dks larks\"kizn :i ls iw.kZ fd;s tkus ij jktLFkku flfoy lsok ¼iqujhf{kr osrueku½ fu;e 2017 ,oa foŸk foHkkx ds uksfVfQds'ku fnukad 30-10-2017 ds fcUnq la[;k 13¼2½ ds izko/kkukuqlkj dkWye 6 esa vafdr LFkk;hdj.k frfFk ,oa fu;fer osru Ja[kyk izkfIr fnukad ls fuEukuqlkj osru fu;ru fd;k tkrk gS &"]
[null,null,null,null,null,null,null,null,null,null,null,"dk;kZy; uke fy[ksa",null,"dk;kZy; iz/kkukpk;Z jktdh; mPp ek/;fed fo|ky; 13 Mhvks,y Jhxaxkuxj"]
["dzl","uke dkfeZd","in","tUe frfFk","dk;Zxzg.k frfFk","LFkk;hdj.k frfFk@a fu;fer osru Ja[kyk izkfIr frfFk","LFkk;hdj.k i'pkr osru fu;ru",null,null,null,"vkxkeh osruo`f) frfFk","tks dkfeZd iwoZ esa lsok esa ugha jgs gS lsok esa u, fu;qDr gq, gS oks bl 'khV dk iz;ksx djsa ;fn iwoZ esa lsok esa jgs gS rks fixation on confirm _in service sheet dke esa ysos",null,null,null,null,null,null,null,null,null,null,null,null,null,null,null,null,null,null,null,null,null,null,null,null,null,null,null,null,null,null,null,null,null,null,{"$f":"YEAR(F9)","v":2020},7,1,{"$f":"MONTH(F9)","v":9}]
[null,null,null,null,null,null,"fnukad","is cS.M","is ysoy","ewy osru",null,"कॉलम 10 में कार्मिक की पे लेवल चुने ",null,"कार्यालय मोहर के लिए",null,null,9,"प्रथम एसीपी",null,"Existing\nR.P.Band","PB-1\n5200-20200",null,null,null,null,null,null,null,null,"PB-2\n9300-34800",null,null,null,"PB-3\n15600-39100",null,null,null,null,null,null,null,"PB-4\n37400-67000",null,null,null,null,{"$f":"YEAR(F10)","v":1900},7,1,{"$f":"MONTH(F10)","v":1}]
["1","2","3","4","5","6","8","9","10","11","12",null,null,null,null,null,null,null,null,null,null,null,null,null,null,null,null,null,null,null,null,null,null,null,null,null,null,null,null,null,null,null,null,null,null,null,1900,7,1,1]
[{"$f":"IF(B9=\"\",\"\",1)","v":1},"Lakhan lal","Sr. Teacher","1991-12-23","2018-09-27","2020-09-27",{"$f":"IF(F9=\"\",\"\",F9)","v":"2020-09-27"},{"$f":"IFERROR(HLOOKUP($I9,Payband,2,0)&\"-\"&HLOOKUP($I9,Payband,3,0),\"\")","v":"33800-106700"},"L_10",{"$f":"IFERROR(IF(B9=\"\",\"\",HLOOKUP($I9,Payband,2,0)),\"\")","v":33800},{"$f":"IFERROR(IF(F9=\"\",\"\",IF(F9<DATE(AU6,AV6,AW6),DATE(AU6,AV6,AW6),DATE((AU6)+1,AV6,AW6))),\"\")","v":"2021-07-01"},"white सेल में सूचना भरें",null,"iz/kkukpk;Z ",null,null,10,"प्रथम एसीपी",null,"Exist.G.P.",1700,1750,1900,2000,2400,2400,2400,2800,2800,3600,4200,4800,5400,5400,6000,6600,6800,7200,7600,8200,8700,8900,9500,10000,null,null,1900,7,1,1]
[{"$f":"IF(B10=\"\",\"\",MAX($A$9:A9)+1)","v":""},null,null,null,null,null,{"$f":"IF(F10=\"\",\"\",F10)","v":""},{"$f":"IFERROR(HLOOKUP($I10,Payband,2,0)&\"-\"&HLOOKUP($I10,Payband,3,0),\"\")","v":""},null,{"$f":"IFERROR(IF(B10=\"\",\"\",HLOOKUP($I10,Payband,2,0)),\"\")","v":""},{"$f":"IFERROR(IF(F10=\"\",\"\",IF(F10<DATE(AU7,AV7,AW7),DATE(AU7,AV7,AW7),DATE((AU7)+1,AV7,AW7))),\"\")","v":""},null,null,"jktdh; mPp ek/;fed fo|ky; ",null,null,18,"द्वितीय एसीपी ",null,"Exist.G.P.No",2,3,4,5,9,"9A","9B",10,"10A",11,12,14,15,15,16,17,18,19,20,21,22,23,"23A",24,null,null,1900,7,1,1]
{"$rows_left_out":42}
{"sheet":"INTRO","index":1,"n_rows":28,"n_cols":3,"rows_kept":28,"cut":false,"hidden":false,"merged":[[0,0,18,0],[0,1,0,3],[1,1,1,2],[1,3,19,3],[2,1,2,2],[4,1,4,2],[13,2,17,2],[19,0,19,2]]}
[]
[null,"ALL-IN-ONE PAY FIXATION AND ARREAR CALCULATION EXCEL UTILITY 2020"]
[null,"HOW TO USE   "]
[null,null,"राजस्थान राज्य कर्मचारियों के  लिए PAY FIXATION AND ARREAR   बाबत इस UTILITY का प्रयोग किया जा सकता है । FILE को SAVE करने के लिए अपनी सुविधा से नाम देकर SAVE AS से Excel Macro- Enable Workbook के रूप में Save करें। file को open करते समय Enable Macro करें।यह excel utility केवल मात्र राज्य कार्मिको के PAY FIXATION AND ARREAR के लिए सहायतार्थ तैयार की गई है ।यद्यपि इसे तैयार करने में पूर्ण सावधानी बरती गई है फिर भी किसी भूल चूक के लिए तैयार कर्ता उत्तरदायी नहीं है । किसी भी गणना के लिए त्रुटि पाए जाने पर आयकर विभाग के नियम मान्य होंगे  किसी प्रकार की तकनीकी कमी पाए जाने पर नीचे दिये गए EMAIL द्वारा अवगत कराने का श्रम करावे।(PLEASE USE LATEST VERSION OF THAT IS  OFFICE 2010 AND ABOVE FOR BEST RESULT)"]
[null,"   1. First Enable Macro whenever open file                    "]
[null,"1. MASTER :-","MASTER SHEET में कार्मिक के वेतन निर्धारण संबन्धित सूचनाएँ जैसे नाम, पदनाम, वेतन नियतन का प्रकार ,वेतन नियतन दिनांक संबन्धित ,आदेश क्रमांक इत्यादि भरें"]
[null,"2. DATA ENTRY SHEET","DATA ENTRY SHEET में जितने माह का ARREAR देय है के माह नाम और मास्टर शीट और ORDER SHEET मे भरे डाटा अनुसार BASIC PAY ऑटोमैटिक शो होगी।यदि बेसिक मे किसी माह मे बदलाव अपेक्षित है तो EDIT BASIC PAY कॉलम मे संबन्धित माह के सम्मुख भरे। वार्षिक वेतन वृद्धि ऑटोमैटिक लग जाएगी। इस शीट मे CHECK & EDIT की सुविधा दी गई है।यदि आप NPS EMPLOYEE है तो इसी शीट मे ड्रॉपडाउन से चयन करे। DA और HRA की दर आपको संबन्धित माह के सामने लिखनी है।"]
[null,"3. ORDER  sheet","ORDER की भाषा MASTER शीट मे आप द्वारा चयन किए गए वेतन नियतन के प्रकार के आधार पर डाइनैमिक ऑटोमैटिक तैयार होगा।बाकी स्थायीकरण/एसीपी/पदोन्नति के लिए काम मे लेने के HELPING POINTS शीट मे दिये गए है"]
[null,"4. ARREAR SHEET ","ARREAR शीट मे NPS की DEDUCTION ऑटोमैटिक होगी बाकी आवश्यकतानुसार MANUALLY भरनी होगी। अनावश्यक ROW और कॉलम को HIDE करके प्रिंट निकाल सकते है।"]
[]
{"$rows_left_out":19}
{"sheet":"MASTER","index":2,"n_rows":35,"n_cols":20,"rows_kept":35,"cut":false,"hidden":false,"merged":[[32,2,32,3],[34,2,34,3],[32,6,32,8],[1,2,1,9],[7,6,7,8],[9,5,9,7],[9,9,13,9],[11,5,11,7],[13,5,13,7],[15,5,15,7],[15,2,15,4],[26,2,26,8],[28,12,28,14],[29,12,29,14],[30,12,30,14],[28,5,28,6],[28,7,28,8],[30,2,30,8],[26,12,27,14],[17,2,17,8],[19,3,19,8],[23,3,23,8],[21,3,21,8]]}
[]
[null,"कार्यालय","प्रधानाचार्य राजकीय उच्च माध्यमिक विद्यालय 13डीओएल श्री गंगानगर "]
[null,null,null,null,null,null,null,null,null,null,null,null,null,"पदनाम","CONFIRMATION ",null,null,null,null,"CADER"]
[null,null,null,null,null,null,null,null,null,null,null,null,null,"PRINCIPAL","ACP ",null,null,null,null,"State Service"]
[null,null,null,null,null,null,null,null,null,null,null,null,null,"HEADMASTER","PROMOTION ",null,null,null,null,"Subordinate "]
[null,null,"NAME EMPLOYEE","RAMCHANDER SWAMI",null,"POST","HEADMASTER","CADER","State Service",null,null,null,null,"LECTURER","NOTIONAL",null,null,null,null,"Ministrial"]
[null,null,null,null,null,null,null,"Pay Leval","L_9",null,null,null,null,"SR.TEACHER",null,null,null,null,null,"Class IV"]
[null,null,"पदस्थापन स्थान","GSSS 13DOL",null,"Emp ID","RJGA99999999999",null,null,null,null,null,null,"TEACHER"]
[null,null,null,null,null,null,null,null,null,null,null,null,null,"PRABODHAK"]
[null,null,"वास्तविक कार्यग्रहण तिथि","2013-09-11",null,{"$f":"IF($D$12=\"\",\"Fill reason of fixation above\",\"वेतन नियतन\"&\" (\"&$D$12&\")\"&\"से पूर्व पे -लेवल \")","v":"वेतन नियतन (CONFIRMATION )से पूर्व पे -लेवल "},{"$f":"IF($D$12=\"\",\"Fill reason of fixation above\",\"वेतन नियतन\"&\" (\"&$D$12&\")\"&\"दिनांक\")","v":"वेतन नियतन (CONFIRMATION )दिनांक"},"वेतन नियतन (CONFIRMATION )दिनांक","L_11",null,null,null,null,"PTI"]
{"$rows_left_out":26}
{"sheet":"ORDER","index":3,"n_rows":59,"n_cols":58,"rows_kept":59,"cut":false,"hidden":false,"merged":[[37,18,37,22],[38,18,38,22],[44,18,45,22],[39,18,41,22],[42,18,43,22],[34,18,35,22],[29,18,30,22],[31,18,33,22],[6,16,6,51],[24,18,25,22],[21,18,23,22],[27,18,27,22],[28,18,28,22],[16,18,17,22],[19,18,19,22],[20,18,20,22],[7,16,7,22],[7,7,7,8],[11,18,12,22],[10,18,10,22],[13,18,15,22],[9,18,9,22],[8,18,8,22],[7,14,8,14],[12,5,12,8],[19,1,19,2],[11,16,14,17],[1,1,1,13],[3,1,3,13],[7,6,8,6],[7,9,7,12],[7,13,8,13],[8,16,9,17],[7,1,8,1],[7,2,8,2],[7,3,8,3],[7,4,8,4],[6,1,6,13],[4,1,4,13],[5,1,5,13],[7,5,8,5]]}
[]
[null,{"$f":"MASTER!B2&\" \"&MASTER!C2","v":"कार्यालय प्रधानाचार्य राजकीय उच्च माध्यमिक विद्यालय 13डीओएल श्री गंगानगर "}]
[null,null,"dzekad",null,null,null,null,null,null,null,null,"fnukad"]
[null,"dk;kZy; vkns'k"]
[null,{"$f":"MASTER!D20&\" \"&MASTER!D22&\" के \"&MASTER!C24&\" \"&MASTER!D24&\" \"&\" की अनुपालना में\"","v":"श्रीमान संयुक्त निदेशक संयुक्त निदेशक स्कूल शिक्षा ,बीकानेर संभाग,बीकानेर  के आदेश क्रमांक सनि/स्कू.शि. /2020/स्थायीकरण/1632 दिनांक 15.10.2020  की अनुपालना में"}]
[null,{"$f":"IF(MASTER!D12=\"CONFIRMATION \",control!K2,IF(MASTER!D12=\"ACP \",control!Y3,IF(MASTER!D12=\"PROMOTION \",control!Y7,IF(MASTER!D12=\"NOTIONAL\",control!AA3,\"\"))))","v":" इस विद्यालय में कार्यरत निम्नांकित कार्मिक का कॉलम 3 में अंकित पद पर कॉलम 5 में अंकित कार्यग्रहण करने की दिनांक से दो वर्ष की परिवीक्षाधीन प्रशिक्षणार्थी की अवधि को संतोषप्रद रूप से पूर्ण किये जाने पर राजस्थान सिविल सेवा (पुनरीक्षित वेतनमान) नियम 2017 एवं वित्त विभाग के नोटिफिकेशन दिनांक 30.10.2017 के बिन्दु संख्या 13(2) के प्रावधानानुसार कॉलम 6 में अंकित स्थायीकरण तिथि एवं नियमित वेतन श्रंखला प्राप्ति दिनांक से निम्नानुसार वेतन नियतन किया जाता है-"},null,null,null,null,null,null,null,null,null,null,null,null,null,null,null,null,null,null,null,null,null,null,null,null,null,null,null,null,null,null,null,null,null,null,null,null,null,null,null,null,null,null,null,null,null,null,null,null,null,null,null,{"$f":"TODAY()","v":"2021-04-21"},"DATE",{"$f":"YEAR(BB6)","v":2021},7,1]
[null,{"$f":"IF(MASTER!D12=\"ACP \",\"PAY FIXATION AFTER\"&\" \"&MASTER!D12&\"(\"&MASTER!F16&\")\",\"PAY FIXATION AFTER\"&\" \"&MASTER!D12)","v":"PAY FIXATION AFTER CONFIRMATION "}]
[null,"dzl","नाम कार्मिक ","पद ","पदस्थापन स्थान",{"$f":"IF(MASTER!$D$12=\"NOTIONAL\",\"नोशनल लाभ तिथि\",\"कार्यग्रहण तिथि\")","v":"कार्यग्रहण तिथि"},{"$f":"IFERROR(IF(MASTER!$D$12=\"CONFIRMATION \",\"स्थायीकरण तिथि/ नियमित वेतन श्रंखला प्राप्ति तिथि\",IF(MASTER!$D$12=\"ACP \",\"एसीपी प्राप्ति तिथि \",IF(MASTER!$D$12=\"PROMOTION \",\"पदौनती प्राप्ति तिथि\",IF(MASTER!$D$12=\"NOTIONAL\",\"नोशनल स्थायीकरण तिथि/ नियमित वेतन श्रंखला प्राप्ति तिथि\",\"मास्टर शीट से चयन करे\")))),\"\")","v":"स्थायीकरण तिथि/ नियमित वेतन श्रंखला प्राप्ति तिथि"},{"$f":"IF(MASTER!$D$12=\"CONFIRMATION \",\"स्थायीकरण दिनांक से पूर्व वेतन\",IF(MASTER!$D$12=\"ACP \",\"एसीपी दिनांक से पूर्व वेतन\",IF(MASTER!$D$12=\"PROMOTION \",\"पदौनती दिनांक से पूर्व वेतन\",IF(MASTER!$D$12=\"NOTIONAL\",\"नोशनल लाभ तिथि को देय वेतन\",\"मास्टर शीट से चयन करे\"))))","v":"स्थायीकरण दिनांक से पूर्व वेतन"},null,{"$f":"IF(MASTER!$D$12=\"CONFIRMATION \",\"स्थायीकरण उपरांत वेतन नियतन\",IF(MASTER!$D$12=\"ACP \",\"एसीपी उपरांत वेतन नियतन\",IF(MASTER!$D$12=\"PROMOTION \",\"पदौनती उपरांत वेतन नियतन\",IF(MASTER!$D$12=\"NOTIONAL\",\"नोशनल स्थाईकरण उपरांत वेतन नियतन \",\"मास्टर शीट से चयन करे\"))))","v":"स्थायीकरण उपरांत वेतन नियतन"},null,{"$f":"IF(MASTER!$D$12=\"CONFIRMATION \",\"स्थायीकरण दिनांक से पूर्व वेतन\",IF(MASTER!$D$12=\"ACP \",\"एसीपी दिनांक से पूर्व वेतन\",IF(MASTER!$D$12=\"PROMOTION \",\"पदौनती दिनांक से पूर्व वेतन\",\"मास्टर शीट से चयन करे\")))","v":"स्थायीकरण दिनांक से पूर्व वेतन"},null,"आगामी वेतनवृद्धि","विशेष विवरण",null,"मास्टर शीट मे CONFIRMATION/ACP/PROMOTION का चयन करने पर आदेश ऑटोमैटिक GENERATE होगा",null,null,null,null,null,null,null,null,null,null,null,null,null,null,null,null,null,null,null,null,null,null,null,null,null,null,null,null,null,null,null,null,null,null,null,null,{"$f":"YEAR(G11)","v":2017},7,1,{"$f":"MONTH(G11)","v":1}]
[null,null,null,null,null,null,null,"पे लेवल","मूल वेतन","दिनांक","पे बैण्ड","पे लेवल","मूल वेतन",null,null,null,null,null,"HELPING POINT",null,null,null,null,9,"प्रथम एसीपी",null,"Existing\nR.P.Band","PB-1\n5200-20200",null,null,null,null,null,null,null,null,"PB-2\n9300-34800",null,null,null,"PB-3\n15600-39100",null,null,null,null,null,null,null,"PB-4\n37400-67000",null,null,null,null,{"$f":"YEAR(J12)","v":2017},7,1,1]
[null,"1","2","3","4","5","6",7,8,9,10,11,12,13,14,null,null,null,"स्थाईकरण हेतु",null,null,null,null,null,null,null,null,null,null,null,null,null,null,null,null,null,null,null,null,null,null,null,null,null,null,null,null,null,null,null,null,null,null,{"$f":"YEAR(J13)","v":2018},7,1,1]
{"$rows_left_out":50}
{"sheet":"DATA ENTRY","index":4,"n_rows":71,"n_cols":29,"rows_kept":71,"cut":false,"hidden":false,"merged":[[5,9,5,11],[5,1,5,3],[5,4,5,6],[7,4,7,5],[1,1,1,12],[2,1,2,12],[3,1,3,3],[3,9,3,11],[3,4,3,6],[6,7,6,9],[8,2,8,11],[7,1,7,3],[9,1,10,1],[9,2,9,6],[9,8,9,12]]}
[]
[null,{"$f":"MASTER!B2&\" \"&MASTER!C2","v":"कार्यालय प्रधानाचार्य राजकीय उच्च माध्यमिक विद्यालय 13डीओएल श्री गंगानगर "}]
[null,null,null,null,null,null,null,null,null,null,null,null,null,null,null,null,null,null,null,null,null,null,null,null,null,null,null,null,"MONTHS"]
[null,"Name Of Employee",null,null,{"$f":"MASTER!D6","v":"RAMCHANDER SWAMI"},null,null,null,null,"ARE YOU \"NPS\" Employee ",null,null,"Yes",null,null,null,null,null,null,null,null,null,null,null,null,null,null,null,"JAN"]
[null,null,null,null,null,null,null,null,null,null,null,null,null,null,null,null,null,null,null,null,null,null,null,null,null,null,null,null,"FEB"]
[null,"Post",null,null,{"$f":"MASTER!G6","v":"HEADMASTER"},null,null,null,null,"वेतन नियतन से पूर्व वेतन का प्रकार",null,null,{"$f":"MASTER!I14","v":"Regular"},null,null,null,null,null,null,null,null,null,null,null,null,null,null,null,"MAR"]
[null,null,null,null,null,null,null,"जिस दिनांक तक ARREAR बनाना यहाँ भरे",null,null,null,null,null,null,null,null,null,null,null,null,null,null,null,null,null,null,null,null,"APR"]
[null,"Type Of Areear",null,null,{"$f":"MASTER!D12&\" \"&\"ARREAR\"","v":"CONFIRMATION  ARREAR"},null,"From",{"$f":"MASTER!D14","v":"2017-01-01"},"to","2021-12-31",null,"TOTAL MONTHS",{"$f":"DATEDIF(H8,J8,\"m\")+1","v":60},null,null,null,null,null,null,null,null,null,null,null,null,null,null,null,"MAY"]
[null,null,"{नोट:- इस शीट में एंट्री करने से पूर्व MASTER sheet और ORDER SHEET में आवश्यक पूर्तियाँ करें}",null,null,null,null,null,null,null,null,null,null,null,null,null,null,null,null,null,null,null,null,null,null,null,null,null,"JUN"]
[null,"SN","वेतन उठाना है(Due)",null,null,null,null,null,"वेतन उठाया गया(Drawn)",null,null,null,null,null,null,"DA RATE",null,null,null,null,null,null,null,null,null,null,null,null,"JUL"]
{"$rows_left_out":62}
{"sheet":"ARREAR","index":5,"n_rows":74,"n_cols":35,"rows_kept":74,"cut":false,"hidden":false,"merged":[[1,1,1,34],[2,1,2,34],[3,2,3,3],[3,4,3,7],[3,31,3,33],[3,12,3,14],[5,15,5,29],[5,31,7,31],[5,32,7,32],[5,33,7,33],[5,34,7,34],[6,24,6,26],[6,27,6,29],[6,21,6,23],[5,7,5,10],[5,11,5,14],[6,8,7,8],[6,9,7,9],[6,10,7,10],[6,11,7,11],[6,12,7,12],[73,29,73,32],[71,29,71,32],[72,29,72,32],[6,13,7,13],[68,1,68,2],[6,14,7,14],[6,15,6,17],[6,18,6,20],[6,3,7,3],[6,4,7,4],[6,5,7,5],[6,6,7,6],[6,7,7,7],[5,1,7,1],[5,2,7,2],[5,3,5,6]]}
[]
[null,{"$f":"ORDER!B2","v":"कार्यालय प्रधानाचार्य राजकीय उच्च माध्यमिक विद्यालय 13डीओएल श्री गंगानगर "}]
[null,{"$f":"'DATA ENTRY'!E8&\" \" &\"FROM\"&\"  \"&TEXT('DATA ENTRY'!H8,\"Mmmm-yyyy\")&\"  \"&\"TO\"&\"  \"&TEXT('DATA ENTRY'!J8,\"mmmm-yyyy\")","v":"CONFIRMATION  ARREAR FROM  January-2017  TO  December-2021"}]
[null,null,"NAME",null,{"$f":"'DATA ENTRY'!E4","v":"RAMCHANDER SWAMI"},null,null,null,null,null,null,"POST",{"$f":"'DATA ENTRY'!E6","v":"HEADMASTER"},null,null,null,null,null,null,null,null,null,null,null,null,null,null,null,null,null,"Emp ID",{"$f":"MASTER!G8","v":"RJGA99999999999"}]
[]
[null,"S.No.","Month","To Be Drawn",null,null,null,"Alread Drawn",null,null,null,"Difference",null,null,null,"Deductions",null,null,null,null,null,null,null,null,null,null,null,null,null,null,null,"Total Deductions","Net Amount","omitted bill no","TV no/date"]
[null,null,null,"Basic","DA","HRA","Total","Basic","DA","HRA","Total","Basic","DA","HRA","Total","NPS",null,null,"GPF",null,null,"SI",null,null,"RPMF",null,null,"CM CORONA RELIEF FUND",null,null,"I.TAX"]
[null,null,null,null,null,null,null,null,null,null,null,null,null,null,null,"Due","Drawn","Diff","Due","Drawn","Diff","Due","Drawn","Diff","Due","Drawn","Diff","Due","Drawn","Diff"]
[{"$f":"IF(D9=\"\",\"v\",\"\")","v":""},{"$f":"IF(control!A9=\"\",\"\",control!A9)","v":1},{"$f":"IF(control!C9=\"\",\"\",control!C9)","v":"Jan-17"},{"$f":"IF(C9=\"March-20\",control!E9/2,control!E9)","v":48400},{"$f":"IFERROR(ROUND(D9*'DATA ENTRY'!F12,0),0)","v":8228},{"$f":"IFERROR(ROUND(D9*'DATA ENTRY'!G12,0),0)","v":3872},{"$f":"IFERROR(D9+E9+F9,0)","v":60500},{"$f":"control!G9","v":46500},{"$f":"IFERROR(IF(MASTER!$I$14=\"Fix Pay\",0,ROUND(H9*'DATA ENTRY'!L12,0)),0)","v":0},{"$f":"IFERROR(IF(MASTER!$I$14=\"Fix Pay\",0,ROUND(H9*'DATA ENTRY'!M12,0)),0)","v":0},{"$f":"IFERROR(H9+I9+J9,0)","v":46500},{"$f":"IFERROR(D9-H9,0)","v":1900},{"$f":"IFERROR(E9-I9,0)","v":8228},{"$f":"IFERROR(F9-J9,0)","v":3872},{"$f":"IFERROR(L9+M9+N9,0)","v":14000},{"$f":"IFERROR(IF('DATA ENTRY'!$M$4=\"YES\",ROUND((ARREAR!D9+ARREAR!E9)*10%,0),0),0)","v":5663},{"$f":"IFERROR(IF('DATA ENTRY'!$M$4=\"YES\",ROUND((ARREAR!H9+ARREAR!I9)*10%,0),0),0)","v":4650},{"$f":"IFERROR(P9-Q9,0)","v":1013},null,null,{"$f":"IFERROR(S9-T9,0)","v":0},null,null,{"$f":"IFERROR(V9-W9,0)","v":0},null,null,{"$f":"IFERROR(Y9-Z9,0)","v":0},null,null,{"$f":"IFERROR(AB9-AC9,0)","v":0},100,{"$f":"R9+U9+X9+AA9+AD9+AE9","v":1113},{"$f":"O9-AF9","v":12887}]
[{"$f":"IF(D10=\"\",\"v\",\"\")","v":""},{"$f":"IF(control!A10=\"\",\"\",control!A10)","v":2},{"$f":"IF(control!C10=\"\",\"\",control!C10)","v":"Feb-17"},{"$f":"IF(C10=\"March-20\",control!E10/2,control!E10)","v":48400},{"$f":"IFERROR(ROUND(D10*'DATA ENTRY'!F13,0),0)","v":8228},{"$f":"IFERROR(ROUND(D10*'DATA ENTRY'!G13,0),0)","v":3872},{"$f":"IFERROR(D10+E10+F10,0)","v":60500},{"$f":"control!G10","v":46500},{"$f":"IFERROR(IF(MASTER!$I$14=\"Fix Pay\",0,ROUND(H10*'DATA ENTRY'!L13,0)),0)","v":0},{"$f":"IFERROR(IF(MASTER!$I$14=\"Fix Pay\",0,ROUND(H10*'DATA ENTRY'!M13,0)),0)","v":0},{"$f":"IFERROR(H10+I10+J10,0)","v":46500},{"$f":"IFERROR(D10-H10,0)","v":1900},8228,3872,{"$f":"IFERROR(L10+M10+N10,0)","v":14000},{"$f":"IFERROR(IF('DATA ENTRY'!$M$4=\"YES\",ROUND((ARREAR!D10+ARREAR!E10)*10%,0),0),0)","v":5663},{"$f":"IFERROR(IF('DATA ENTRY'!$M$4=\"YES\",ROUND((ARREAR!H10+ARREAR!I10)*10%,0),0),0)","v":4650},{"$f":"IFERROR(P10-Q10,0)","v":1013},null,null,{"$f":"IFERROR(S10-T10,0)","v":0},null,null,{"$f":"IFERROR(V10-W10,0)","v":0},null,null,{"$f":"IFERROR(Y10-Z10,0)","v":0},null,null,{"$f":"IFERROR(AB10-AC10,0)","v":0},null,{"$f":"R10+U10+X10+AA10+AD10+AE10","v":1013},{"$f":"O10-AF10","v":12987}]
{"$rows_left_out":65}
{"sheet":"control","index":6,"n_rows":68,"n_cols":27,"rows_kept":68,"cut":false,"hidden":true,"merged":[[6,1,6,2],[6,23,9,23],[2,23,5,23],[3,5,4,6],[6,3,6,4],[6,5,6,6],[1,10,5,22],[1,9,5,9]]}
[null,null,"MASTER"]
[null,"CADER",{"$f":"MASTER!I6","v":"State Service"},null,"pay leval",{"$f":"RIGHT(MASTER!I7,2)","v":"_9"},null,null,null,"CONFIRMATION ORDER"," इस विद्यालय में कार्यरत निम्नांकित कार्मिक का कॉलम 3 में अंकित पद पर कॉलम 5 में अंकित कार्यग्रहण करने की दिनांक से दो वर्ष की परिवीक्षाधीन प्रशिक्षणार्थी की अवधि को संतोषप्रद रूप से पूर्ण किये जाने पर राजस्थान सिविल सेवा (पुनरीक्षित वेतनमान) नियम 2017 एवं वित्त विभाग के नोटिफिकेशन दिनांक 30.10.2017 के बिन्दु संख्या 13(2) के प्रावधानानुसार कॉलम 6 में अंकित स्थायीकरण तिथि एवं नियमित वेतन श्रंखला प्राप्ति दिनांक से निम्नानुसार वेतन नियतन किया जाता है-"]
[null,null,null,null,null,null,null,null,null,null,null,null,null,null,null,null,null,null,null,null,null,null,null,"ACP","राजस्थान सरकार वित्त विभाग के आदेशांक F15(1)/FD@Rules/2017 जयपुर दिनांक 30.10.2017 के अनुसार में राजस्थान सिविल सेवा (पुनरीक्षित वेतनमान) नियम, 2017 द्वितीय संषोधन के नियम 14 एवं 15 के तहत  इस विद्यालय के निम्नांकित कार्मिक का उनके नाम के सम्मुख अंकित तिथि से  ए0 सी0 पी0 ( Assured Career Progression ) की स्वीकृति प्रदान किये जाने के फलस्वरूप निम्नानुसार वेतन निर्धारण किया जाता हैः-","notional","माननीय उच्च न्यायालय जोधपुर/जयपुर के निर्णयानुसार तृतीय श्रेणी प्राथमिक ओर उच्च प्राथमिक विद्यालय अध्यापक भर्ती 2013 के अन्तर्गत संशोधित एवं पुनः संशोधित परिणाम से चयनोपरान्त शिक्षकों को नोशनल परिलाभ हेतु पारित निर्णय के पालनार्थ श्रीमान वरिष्ठ विधि परामर्शी प्रारम्भिक शिक्षा (विधि प्रकोष्ठ) राजस्थान जयपुर के पत्रांक प.18(279) प्रा.शि/वि.प्र./18/जयपुर दिनांक 20.11.2018 की अनुपालना में  इस कार्यालय के निम्नांकित  कार्मिक के वास्तविक प्रथम कार्यग्रहण तिथि को माननीय न्यायालय के निर्णयानुसार नोशनल/वरिष्ठता परिलाभ हेतु निर्धारित तिथि (प्रथम परिणाम नियुक्त शिक्षको की कार्यग्रहण तिथि)  से नोशनल परिलाभ हेतु स्थायीकरण तिथि करने एवं वास्तविक कार्यग्रहण तिथि से दो वर्ष परिविक्षाकाल पूर्ण होने पर स्थाईकरण  किये जाने पर निम्नानुसार वेतन निर्धारण किया जाता है:-\""]
[null,"FROM",{"$f":"'DATA ENTRY'!H8","v":"2017-01-01"},"TO",{"$f":"'DATA ENTRY'!J8","v":"2021-12-31"},"TOTAL DAYS OF STARTING MONTH",null,{"$f":"DAY(EOMONTH(C4,0))","v":31}]
[null,"EOMONTH",{"$f":"EOMONTH(C4,0)","v":"2017-01-31"},null,null,null,null,null,"2020-03-01"]
[null,"DAYS",{"$f":"DATEDIF(C4,C5,\"D\")+1","v":31},null,{"$f":"ROUND($D$9/$H$4*$C$6,0)","v":48400},null,{"$f":"ROUND(F9/H4*C6,0)","v":46500},null,{"$f":"TEXT(I5,\"mmm\"&\"-\"&\"yy\")","v":"Mar-20"}]
[null,"MONTH",null,"DUE",null,"DRWAN",null,null,{"$f":"VLOOKUP($I$6,$C$9:$E56,3,0)","v":52900},null,null,null,null,null,null,null,null,null,null,null,null,null,null,null,{"$f":"CONCATENATE(\"इस विद्यालय में कार्यरत निम्नांकित कार्मिक का\" &\"  \"&MASTER!D29&\" से \"&MASTER!H29&\" पद पर पदोन्नति होने पर निम्नानुसार वेतन नियतन किया जाता है।\")","v":"इस विद्यालय में कार्यरत निम्नांकित कार्मिक का  SR.TEACHER से LECTURER पद पर पदोन्नति होने पर निम्नानुसार वेतन नियतन किया जाता है।"}]
[null,null,null,"BASIC","EDIT BASIC","BASIC","EDIT BASIC",null,null,null,"ROUND($D$9/$H$4*$C$6,0)"]
[{"$f":"IF(B9=\"\",\"\",1)","v":1},{"$f":"IF(C4=\"\",\"\",DATE(YEAR(C4),MONTH(C4),DAY(C4)))","v":"2017-01-01"},{"$f":"TEXT(B9,\"mmm\"&\"-\"&\"YY\")","v":"Jan-17"},{"$f":"'DATA ENTRY'!D12","v":48400},{"$f":"IF('DATA ENTRY'!C12=\"\",\"\",ROUND(IF('DATA ENTRY'!E12=\"\",'DATA ENTRY'!D12,'DATA ENTRY'!E12)/$H$4*$C$6,0))","v":48400},{"$f":"'DATA ENTRY'!J12","v":46500},{"$f":"IF('DATA ENTRY'!I12=\"\",\"\",ROUND(IF('DATA ENTRY'!K12=\"\",'DATA ENTRY'!J12,'DATA ENTRY'!K12)/$H$4*$C$6,0))","v":46500},null,{"$f":"IF(OR($C$2=\"All India Services\",$C$2=\"State Service\"),ROUND(I7/31*5,0),IF(AND($C$2=\"Subordinate\",$Z$18>9),ROUND(I7/31*3,0),IF(AND($C$2=\"Subordinate\",OR(F2>4,F2<10)),ROUND(I7/31*2,0),IF($C$2=\"Ministrial\",ROUND(I7/31*2,0),IF(OR($C$2=\"Class IV\",$F$2<5),ROUND(I7/31*1,0))))))","v":8532},null,null,null,null,"NOTIONAL FITMENT"]
[{"$f":"IF(B10=\"\",\"\",A9+1)","v":2},{"$f":"IF(B9=\"\",\"\",IF(EOMONTH(B9,0)+1>$E$4,\"\",EOMONTH(B9,0)+1))","v":"2017-02-01"},{"$f":"TEXT(B10,\"mmm\"&\"-\"&\"YY\")","v":"Feb-17"},{"$f":"'DATA ENTRY'!D13","v":48400},{"$f":"IF('DATA ENTRY'!C13=\"\",\"\",IF('DATA ENTRY'!E13=\"\",'DATA ENTRY'!D13,'DATA ENTRY'!E13))","v":48400},{"$f":"'DATA ENTRY'!J13","v":46500},{"$f":"IF('DATA ENTRY'!I13=\"\",\"\",IF('DATA ENTRY'!K13=\"\",'DATA ENTRY'!J13,'DATA ENTRY'!K13))","v":46500},null,null,null,"वास्तविक स्थाईकरण",null,null,"YEAR","LEVAL","PAY"]
{"$rows_left_out":59}
{"sheet":"7th pay chart","index":7,"n_rows":60,"n_cols":25,"rows_kept":60,"cut":false,"hidden":false,"merged":[[0,1,0,9],[0,10,0,13],[0,14,0,21],[0,22,0,24]]}
["Existing\nR.P.Band","PB_1\n5200_20200",null,null,null,null,null,null,null,null,"PB_2\n9300_34800",null,null,null,"PB_3\n15600_39100",null,null,null,null,null,null,null,"PB_4\n37400_67000"]
["Exist.G.P.",1700,1750,1900,2000,2400,2400,2400,2800,2800,3600,4200,4800,5400,5400,6000,6600,6800,7200,7600,8200,8700,8900,9500,10000]
["Exist.G.P.No",2,3,4,5,9,"9A","9B",10,"10A",11,12,14,15,15,16,17,18,19,20,21,22,23,"23A",24]
["Levels →","L_1","L_2","L_3","L_4","L_5","L_6","L_7","L_8","L_9","L_10","L_11","L_12","L_13","L_14","L_15","L_16","L_17","L_18","L_19","L_20","L_21","L_22","L_23","L_24"]
["Cell No. ↓",1,2,3,4,5,6,7,8,9,10,11,12,13,14,15,16,17,18,19,20,21,22,23,24]
[1,17700,17900,18200,19200,20800,21500,22400,26300,28700,33800,37800,44300,53100,56100,60700,67300,71000,75300,79900,88900,123100,129700,145800,148800]
[2,18200,18400,18700,19800,21400,22100,23100,27100,29600,34800,38900,45600,54700,57800,62500,69300,73100,77600,82300,91600,126800,133600,150200,153300]
[3,18700,19000,19300,20400,22000,22800,23800,27900,30500,35800,40100,47000,56300,59500,64400,71400,75300,79900,84800,94300,130600,137600,154700,157900]
[4,19300,19600,19900,21000,22700,23500,24500,28700,31400,36900,41300,48400,58000,61300,66300,73500,77600,82300,87300,97100,134500,141700,159300,162600]
[5,19900,20200,20500,21600,23400,24200,25200,29600,32300,38000,42500,49900,59700,63100,68300,75700,79900,84800,89900,100000,138500,146000,164100,167500]
{"$rows_left_out":50}