{"text_format":"1","workbook":"xlsx","n_sheets":8,"sheets":["INTRO","Data Entry","Salary","Assesment","Master","HRA","NSC INTT","RULES"],"not_rendered":{"charts":0,"images":3,"macros":1,"external_links":0,"defined_names":7,"comments":2,"pivot_tables":0},"unopened":[],"bounds":{"document_bytes":16777216,"sheet_cells":100000,"rows_first":2000,"rows_last":500,"rows_between":2000,"halvings":0,"cell_chars":16384,"cell_head_chars":4096},"cells_cut":0,"cells_raw":0,"read":"whole","date_system":"1900"}

{"sheet":"INTRO","index":0,"n_rows":41,"n_cols":3,"rows_kept":41,"cut":false,"hidden":false,"merged":[[0,0,18,0],[0,1,0,3],[1,3,19,3],[19,0,19,2],[13,2,17,2],[1,1,1,2],[2,1,2,2],[4,1,4,2]]}
[]
[null,"INCOME TAX ASSESMENT FOR FINANCIAL YEAR 2020-21"]
[null,"HOW TO USE   "]
[null,null,"राजस्थान राज्य कर्मचारियों के  लिए आयकर आकलन   बाबत इस UTILITY का प्रयोग किया जा सकता है । FILE को SAVE करने के लिए अपनी सुविधा से नाम देकर SAVE AS से Excel Macro- Enable Workbook के रूप में Save करें। file को open करते समय Enable Macro करें।यह excel utility केवल मात्र राज्य कार्मिको के income tax assesment के लिए सहायतार्थ तैयार की गई है ।यद्यपि इसे तैयार करने में पूर्ण सावधानी बरती गई है फिर भी किसी भूल चूक के लिए तैयार कर्ता उत्तरदायी नहीं है । किसी भी गणना के लिए त्रुटि पाए जाने पर आयकर विभाग के नियम मान्य होंगे  किसी प्रकार की तकनीकी कमी पाए जाने पर नीचे दिये गए EMAIL द्वारा अवगत कराने का श्रम करावे।(PLEASE USE LATEST VERSION OF THAT IS  OFFICE 2010 AND ABOVE FOR BEST RESULT)"]
[null,"   1. First Enable Macro whenever open file                    2.Install Devlys 010 Hindi font in your computer for view Assesment Sheet"]
[null,"1. Data Entry Sheet :-","Details शीट में कार्मिक की सामान्य सूचना,वेतन भत्ते ,कटौतियों और वेतन से एवं सामान्य आयकर छूट हेतु जमा का विवरण संबन्धित कॉलम में भरना है।शीट में महत्वपूर्ण स्थान पर आवश्यक निर्देश दिये गए है।वेतन से income tax कटौती को आपको manually MONTHLY भरना है।"]
[null,"2. SALARY SHEET","सर्वप्रथम Refresh Salary बटन पर क्लिक कर आप द्वारा Data Entry शीट में भरे data अनुसार सैलरी शीट तैयार हो जाएगी ।यदि कोई बदलाव अपेक्षित है तो शीट मे आपकी आवश्यकता अनुसार कर सकते है।Refresh Salary बटन को क्लिक करने पर पुनः प्रारम्भिक अवस्था मे आ जाएगी । WHITE सेल में आवश्यकता अनुसार प्रविष्टि कर सकते है ।अन्य भत्ते एवं कटौती आप SALARY SHEET में MANUALLY कर सकते है।इसका प्रिंट लेना है ।"]
[null,"3. Assesment  sheet","Assesment  Sheet Auto generate है।आप OLD REGIME या NEW REGIME में से किसी एक का चुनाव option बटन  करे और आपके चुनाव अनुसार Assesment form  रिपोर्ट तैयार प्राप्त करे । OLD REGIME या NEW REGIME में तुलनात्मक कौनसा चुनाव आपके लिए बेहतर की रिपोर्ट भी आप COMAPARISSION के द्वारा देख सकते है।इसका प्रिंट लेना है।"]
{"$rows_left_out":34}
{"sheet":"Data Entry","index":1,"n_rows":49,"n_cols":43,"rows_kept":49,"cut":false,"hidden":false,"merged":[[47,16,47,18],[48,16,48,18],[45,16,45,18],[47,2,48,4],[47,5,48,6],[44,1,44,20],[2,39,2,42],[3,39,3,40],[4,39,4,40],[5,39,5,40],[6,39,6,40],[7,39,7,40],[8,39,8,40],[9,39,9,40],[13,18,13,20],[13,1,13,3],[11,23,11,25],[7,11,7,15],[7,16,7,20],[5,2,5,5],[3,1,3,20],[7,7,7,8],[1,1,2,20],[10,1,10,20],[13,10,13,17],[12,1,12,3],[12,10,12,20],[4,2,4,5],[4,6,4,8],[4,13,4,15],[4,16,4,19],[4,9,4,12],[5,9,5,20],[6,2,6,5],[6,6,6,8],[6,9,6,10],[5,6,5,8],[6,17,6,18],[13,6,13,9],[12,4,12,5],[12,6,12,7],[12,8,12,9],[38,16,38,18],[30,6,30,15],[30,16,30,18],[31,6,31,15],[31,16,31,18],[32,16,32,18],[33,6,33,15],[15,1,15,20],[16,2,16,3],[16,8,16,9],[35,1,35,3],[32,13,32,14],[36,1,36,3],[37,1,37,3],[33,16,33,18],[34,6,34,15],[34,16,34,18],[35,6,35,15],[35,16,35,18],[36,6,36,15],[36,16,36,18],[37,6,37,15],[37,16,37,18],[32,6,32,8],[39,6,39,8],[39,9,39,11],[39,12,39,14],[23,5,38,5],[23,19,38,20],[39,1,39,5],[30,1,30,3],[22,1,22,20],[23,1,23,3],[23,6,23,15],[23,16,23,18],[24,6,24,15],[24,16,24,18],[26,1,26,3],[27,1,27,3],[28,1,28,3],[38,1,38,3],[25,6,25,15],[25,16,25,18],[26,6,26,15],[26,16,26,18],[27,16,27,18],[32,1,32,3],[38,6,38,15],[19,10,20,14],[29,6,29,15],[21,10,21,20],[29,16,29,18],[19,5,19,9],[20,8,20,9],[19,2,19,4],[29,1,29,3],[19,1,21,1],[24,1,25,3],[24,4,25,4],[19,15,20,15],[19,16,20,17],[28,16,28,18],[27,13,27,14],[27,11,27,12],[27,6,27,9],[41,5,41,6],[6,11,6,16],[42,5,42,6],[41,14,41,15],[42,14,42,15],[40,1,40,20],[19,18,20,19],[14,13,14,18],[9,2,9,5],[9,6,9,10],[14,19,14,20],[11,2,11,3],[33,1,33,3],[17,5,17,6],[17,2,17,3],[17,8,17,9],[16,10,16,12],[16,13,16,20],[34,1,34,3],[20,5,20,6],[21,5,21,6],[21,8,21,9],[31,1,31,3],[32,10,32,11],[47,10,48,12],[47,14,47,15],[48,14,48,15],[47,13,48,13],[17,30,17,36],[28,6,28,15],[11,4,11,7],[7,2,7,5],[7,9,7,10],[18,1,18,20],[11,8,11,9],[11,10,11,15],[11,16,11,20],[8,2,8,5],[8,6,8,10],[8,11,8,20],[16,5,16,6],[9,11,9,19],[14,8,14,10],[14,11,14,12],[13,4,13,5],[14,4,14,6],[3,30,7,33],[2,26,3,26]]}
[]
[null,"INCOME TAX ASSESMENT FOR FINANCIAL YEAR 2020-21"]
[null,null,null,null,null,null,null,null,null,null,null,null,null,null,null,null,null,null,null,null,null,null,1,null,null,null,null,null,null,null,null,null,null,null,null,null,null,null,null,"SI PREMIUM FROM SALARY"]
[null,"GENERAL INFORMATION",null,null,null,null,null,null,null,null,null,null,null,null,null,null,null,null,null,null,null,null,2,null,"CADER",null,null,null,null,null,null,null,null,null,null,null,null,null,null,"PAY RANGE",null,"2018-03-01","2020-03-01"]
[null,"NAME OF EMPLOYEE","HANS RAJ JOSHI",null,null,null,"EMPLOYEE ID",null,null,"RJGA99999999999",null,null,null,"PAN NO",null,null,"XXXXX1234X",null,null,null,null,null,3,null,"All India Services",null,null,"L-1",1,null,null,null,null,null,null,null,null,null,null,"UPTO 22000",null,500,800]
[null,"Designation","PRINCIPAL",null,null,null,"OFFICE",null,null,"GOVT. GIRLS SR.SEC.SCHOOL ANUPGARH",null,null,null,null,null,null,null,null,null,null,null,null,4,null,"State Service",null,null,"L-2",2,null,null,null,null,null,null,null,null,null,null,"22001 TO 28500",null,700,1200]
[null,"CADER","State Service",null,null,null,"PAY LEVAL",null,null,"L-23",null,"आप NPS के सदस्य है तो Yes\" नहीं तो  \"No\" चुने",null,null,null,null,null,"No",null,null,null,null,5,null,"Subordinate",null,null,"L-3",3,null,null,null,null,null,null,null,null,null,null,"28501TO 46500",null,1300,2200]
[null,"Mobile No",9461424525,null,null,null,"DOB","1972-08-12",null,"TAN NO",null,null,null,null,null,null,null,null,null,null,null,null,6,null,"Ministrial",null,null,"L-4",4,null,null,null,null,null,null,null,null,null,null,"46501 TO 72000",null,1800,3000]
{"$rows_left_out":42}
{"sheet":"Salary","index":2,"n_rows":32,"n_cols":16384,"rows_kept":32,"cut":false,"hidden":false,"merged":[[30,22,30,26],[5,8,5,10],[4,11,4,13],[13,34,13,35],[14,34,14,35],[15,34,15,35],[16,34,16,35],[17,34,17,35],[29,7,29,10],[6,1,6,11],[6,12,6,28],[9,34,9,37],[10,34,10,35],[11,34,11,35],[12,34,12,35],[28,1,28,2],[4,24,4,25],[5,4,5,6],[5,11,5,12],[0,4,0,11],[1,1,1,28],[2,1,2,28],[3,1,3,28],[4,1,4,4],[4,5,4,10],[4,14,4,17],[4,18,4,19],[4,20,4,23],[4,26,4,27],[0,14,0,28]]}
[null,null,null,null,null,null,null,null,null,null,null,null,null,null,"आप अपनी आवश्यकता अनुसार सैलरी शीट की UNLOCKED CELL मे बदलाव कर सकते है तथा REFRESH SALARY बटन पर क्लिक कर पुनः प्रारम्भिक स्थिति मे आ सकते है। ",null,null,null,null,null,null,null,null,null,null,null,null,null,null,null,null,null,null,null,null,null,null,null,"cader"]
[null,null,null,null,null,null,null,null,null,null,null,null,null,null,null,null,null,null,null,null,null,null,null,null,null,null,null,null,null,null,null,null,null,null,null,null,null,null,"State Service",null,null,"ALLOWANCES"]
[null,{"$f":"Master!AI3","v":"OFFICE OF THE PRINCIPAL GOVT SENIOR SECONDARY SCHOOL 13DOL,SRI GANGANAGAR"},null,null,null,null,null,null,null,null,null,null,null,null,null,null,null,null,null,null,null,null,null,null,null,null,null,null,null,null,null,null,null,null,null,null,null,null,"Subordinate",null,null,"CCA"]
[null,{"$f":"Master!AI4","v":" SALARY STATEMENT FOR FINANCIAL YEAR 2020-21"},null,null,null,null,null,null,null,null,null,null,null,null,null,null,null,null,null,null,null,null,null,null,null,null,null,null,null,null,null,null,null,null,null,null,null,null,"Ministrial",null,null,"WASHING ALLOWANCE"]
[null,"Name of the Employee",null,null,null,{"$f":"IF('Data Entry'!C5=\"\",\"\",'Data Entry'!C5)","v":"HANS RAJ JOSHI"},null,null,null,null,null,"Designation",null,null,{"$f":"IF('Data Entry'!$C$6=\"\",\"\",'Data Entry'!$C$6)","v":"PRINCIPAL"},null,null,null,"PAN ",null,{"$f":"IF('Data Entry'!Q5=\"\",\"\",'Data Entry'!Q5)","v":"XXXXX1234X"},null,null,null,"Date of Birth",null,{"$f":"IF('Data Entry'!H8=\"\",\"\",'Data Entry'!H8)","v":"1972-08-12"},null,null,null,null,null,null,null,null,null,null,null,"Class IV",null,null,"HANDICAPTED ALLWANCE"]
[null,"Employee ID",null,null,{"$f":"IF('Data Entry'!J5=\"\",\"\",'Data Entry'!J5)","v":"RJGA99999999999"},null,null,"Cader",{"$f":"IF('Data Entry'!C7=\"\",\"\",'Data Entry'!C7)","v":"State Service"},null,null,"Employee Type",null,{"$f":"IF('Data Entry'!R7=\"\",\"\",IF('Data Entry'!R7=\"Yes\",\"NPS\",\"OPS\"))","v":"OPS"},null,null,null,null,null,null,null,null,null,null,"Pay leval",{"$f":"IF('Data Entry'!J7=\"\",\"\",'Data Entry'!J7)","v":"L-23"},"Pay March",{"$f":"Master!$AH$10","v":75700},null,null,null,null,null,null,null,null,null,null,null,null,null,"ANY OTHER"]
[null,"PAY & ALLOWANCES",null,null,null,null,null,null,null,null,null,null,"DEDUCTIONS"]
[null,"SN","MONTH","BASIC","DA","HRA","CCA","Bonus","ANY OTHER","ANY OTHER","ARREAR","Gross Salary",{"$f":"IF('Data Entry'!R7=\"YES\",\"NPS\",\"GPF\")","v":"GPF"},"GPF 2004","SIP","SI LOAN","GPF LOAN","HBA","HBA INT","LIC","RPMF","GIS","CM CORONA RELIEF","INCOME TAX","ANY OTHER","Total Deduction","Net paid Amount","BILL NO","TV NO"]
{"$rows_left_out":25}
{"sheet":"Assesment","index":3,"n_rows":69,"n_cols":23,"rows_kept":69,"cut":false,"hidden":false,"merged":[[25,20,27,20],[36,1,45,1],[1,19,2,20],[68,6,68,16],[68,2,68,5],[10,2,10,14],[8,2,8,11],[8,12,8,14],[9,2,9,11],[26,3,26,6],[26,10,26,12],[23,3,23,6],[23,10,23,12],[16,2,16,14],[18,2,18,14],[65,15,65,16],[66,5,66,8],[66,9,66,10],[66,12,66,13],[66,15,66,16],[67,1,67,14],[64,2,64,14],[65,1,66,1],[65,2,66,4],[19,1,34,1],[20,2,20,16],[21,3,21,6],[21,10,21,12],[21,15,30,16],[22,3,22,6],[22,10,22,12],[29,3,29,6],[29,10,29,12],[30,2,30,12],[31,2,31,14],[32,2,32,14],[33,2,33,14],[19,15,19,16],[7,1,9,1],[7,2,7,11],[7,12,7,14],[14,2,14,14],[15,2,15,14],[4,2,4,14],[5,2,5,14],[6,2,6,14],[9,12,9,14],[12,12,12,14],[65,5,65,8],[65,9,65,10],[35,2,35,16],[45,2,45,14],[46,2,46,14],[47,2,47,14],[48,2,48,14],[36,3,36,14],[44,3,44,14],[65,12,65,13],[63,2,63,14],[53,5,53,7],[54,5,54,7],[37,3,37,14],[38,3,38,14],[41,3,41,14],[42,3,42,14],[43,3,43,14],[24,10,24,12],[25,3,25,6],[49,1,62,1],[52,2,52,3],[53,2,53,3],[50,2,50,11],[50,12,50,14],[49,2,49,14],[56,2,57,11],[52,9,52,11],[51,12,51,13],[52,12,52,13],[53,12,53,13],[54,12,54,13],[55,12,55,13],[56,12,56,13],[54,2,54,3],[51,5,51,8],[53,9,53,10],[54,9,54,10],[55,2,55,3],[55,5,55,7],[55,9,55,10],[51,9,51,11],[57,12,57,13],[62,2,62,14],[51,2,51,4],[52,5,52,7],[58,2,58,14],[59,2,59,14],[60,2,60,14],[61,2,61,14],[3,11,3,13],[19,2,19,14],[17,2,17,14],[12,2,13,3],[28,3,28,6],[28,10,28,12],[27,3,27,6],[27,10,27,12],[24,3,24,6],[25,10,25,12],[39,3,39,14],[40,3,40,14],[34,2,34,14],[13,4,13,6],[13,7,13,9],[13,10,13,11],[0,0,0,17],[14,19,15,21],[12,19,13,19],[12,20,13,21],[1,16,2,16],[1,1,1,15],[6,19,7,20],[6,21,7,21],[10,19,11,19],[4,19,5,21],[11,12,11,14],[3,15,3,16],[11,15,13,16],[7,15,8,16],[13,12,13,14],[11,1,13,1],[11,2,11,9],[11,10,11,11],[12,4,12,6],[12,7,12,9],[12,10,12,11],[2,1,2,14],[3,2,3,3],[3,4,3,9]]}
[]
[null,{"$f":"Salary!B3","v":"OFFICE OF THE PRINCIPAL GOVT SENIOR SECONDARY SCHOOL 13DOL,SRI GANGANAGAR"},null,null,null,null,null,null,null,null,null,null,null,null,null,null,{"$f":"IF($W$2=1,\"OLD REGIME\",\"NEW REGIME\")","v":"NEW REGIME"},null,null,null,null,null,2]
[null,"आयकर गणना  प्रपत्र वर्ष 2020-21 (कर निर्धारण वर्ष 2021-22)",null,null,null,null,null,null,null,null,null,null,null,null,null,{"$f":"P51","v":"2"}]
[null,1,"नाम कार्मिक ",null,{"$f":"'Data Entry'!C5","v":"HANS RAJ JOSHI"},null,null,null,null,null,"पद",{"$f":"'Data Entry'!C6","v":"PRINCIPAL"},null,null,"PAN :",{"$f":"'Data Entry'!Q5","v":"XXXXX1234X"}]
[null,2,"आय : वर्ष 2020-21 में प्राप्त कुल वेतन (कर योग्य सुविधाओं के मूल्य सहित )",null,null,null,null,null,null,null,null,null,null,null,null,"रु.",{"$f":"IF('Data Entry'!$R$7=\"NO\",Salary!$L$29,SUM(Salary!$L$29,Salary!$M$29))","v":1185571},null,null,"COMPARISION"]
[null,3,"गृह किराया, धारा 10(13-।) के अन्तर्गत एवं धारा 10(14)के अन्तगर्त अन्य भते जो कर मुक्त्त है",null,null,null,null,null,null,null,null,null,null,null,null,"रु.",{"$f":"IF($P$3=\"1\",-SUM('Data Entry'!$H$17,'Data Entry'!$C$18),0)","v":0}]
[null,4,"                                                              शेष (2-3)",null,null,null,null,null,null,null,null,null,null,null,null,"रु.",{"$f":"$Q$5+$Q$6","v":1185571},null,null,"OLD REGIME",null,"NEW REGIME"]
[null,5," (i)मनोरंजन भता धारा 16 (ii) के अन्तगर्त ( अधिकतम सीमा रू 5000 )",null,null,null,null,null,null,null,null,null,{"$f":"IF($P$3=\"1\",'Data Entry'!F18,0)","v":0}]
{"$rows_left_out":62}
{"sheet":"Master","index":4,"n_rows":100,"n_cols":57,"rows_kept":100,"cut":false,"hidden":true,"merged":[[91,4,91,6],[91,13,91,14],[23,4,23,6],[25,2,25,3],[25,4,25,6],[20,4,20,6],[49,1,50,2],[49,3,49,5],[50,3,50,5],[50,6,50,8],[26,2,26,3],[26,4,26,6],[40,1,40,2],[50,13,50,15],[50,9,50,10],[39,0,39,15],[27,2,27,6],[49,9,49,10],[49,6,49,8],[44,0,46,0],[44,1,44,10],[81,1,81,15],[49,13,49,15],[48,0,50,0],[10,34,10,35],[18,21,18,22],[86,9,86,16],[40,16,40,17],[41,1,41,15],[42,1,42,15],[43,1,43,15],[61,9,61,13],[53,1,53,15],[55,1,55,15],[54,1,54,15],[46,13,46,15],[82,1,82,15],[80,1,80,13],[74,1,74,15],[14,26,14,27],[15,26,15,27],[16,21,16,22],[45,13,45,15],[77,1,77,15],[64,2,64,5],[51,1,51,15],[52,1,52,15],[48,16,50,17],[8,26,8,29],[9,26,9,27],[10,26,10,27],[11,26,11,27],[12,26,12,27],[13,26,13,27],[5,26,5,27],[6,26,6,27],[0,0,0,18],[3,11,3,14],[1,15,2,16],[1,17,2,17],[4,15,4,17],[3,26,3,27],[1,21,1,25],[1,26,1,30],[2,21,2,23],[2,24,2,25],[2,26,2,27],[4,26,4,27],[4,3,5,3],[4,2,5,2],[48,1,48,8],[48,9,48,10],[48,13,48,15],[76,1,76,15],[95,13,95,14],[87,13,87,16],[90,0,90,1],[91,0,91,1],[92,0,92,1],[93,0,93,1],[94,4,94,6],[94,8,94,9],[94,13,94,14],[92,4,92,6],[92,13,92,14],[93,4,93,6],[87,1,87,10],[88,1,88,3],[89,13,89,14],[93,13,93,14],[90,4,90,6],[89,9,89,12],[89,4,89,8],[79,0,80,0],[56,0,71,0],[56,1,56,17],[57,1,57,17],[78,1,78,15],[79,1,79,15],[75,1,75,15],[64,9,64,13],[61,2,61,5],[63,2,63,5],[63,9,63,13],[60,2,60,5],[60,9,60,13],[58,2,58,5],[58,16,67,17],[59,2,59,5],[59,9,59,13],[18,9,18,11],[18,12,18,14],[46,1,46,10],[72,1,72,17],[73,1,73,15],[23,1,23,3],[22,1,22,3],[21,1,21,3],[20,1,20,3],[22,4,22,6],[21,4,21,6],[24,4,24,6],[27,11,27,12],[19,2,19,3],[27,16,27,18],[44,13,44,15],[45,1,45,10],[29,17,29,18],[30,17,30,18],[26,16,26,18],[25,17,25,20],[44,16,45,17],[58,9,58,13],[19,4,19,6],[99,1,99,15],[97,6,97,16],[47,1,47,15],[96,14,96,16],[83,1,83,15],[84,1,84,15],[85,1,85,15],[68,1,68,15],[69,1,69,15],[70,1,70,15],[71,1,71,15],[65,2,65,5],[65,9,65,13],[66,2,66,5],[66,9,66,13],[67,1,67,13],[62,2,62,5],[62,9,62,13],[91,9,91,10],[92,9,92,10],[90,9,90,10],[90,13,90,14],[93,9,93,10],[94,0,94,1]]}
["Master Sheet"]
[null,null,null,null,"EMPLOYEE TYPE",null,{"$f":"Salary!N6","v":"OPS"},null,{"$f":"'Data Entry'!H8","v":"1972-08-12"},null,null,"Bonus",{"$f":"'Data Entry'!H15","v":"No"},"Bonus months",{"$f":"'Data Entry'!L15","v":12}," EMPLOYEE FROM MEDICAL DEP.,JUDICIARY DEP.POLICE CONSTABLE OR CLASS IV(L-1 TO L-4)",null,false,null,null,null,null,null,null,null,null,"rpmf"]
[null,{"$f":"'Data Entry'!C5","v":"HANS RAJ JOSHI"},null,{"$f":"'Data Entry'!C6","v":"PRINCIPAL"},{"$f":"'Data Entry'!C7","v":"State Service"},null,{"$f":"'Data Entry'!J7","v":"L-23"},{"$f":"'Data Entry'!J5","v":"RJGA99999999999"},{"$f":"'Data Entry'!Q5","v":"XXXXX1234X"},null,"HRA exemption",{"$f":"IF(M2=\"No\",0,ROUND((6774*O2/12),0))","v":0},{"$f":"ROUND(L3*75%,0)","v":0},{"$f":"L3-M3","v":0},null,null,null,null,null,null,null,null,null,null,"deduction",null,"PAY RANGE",null,"2019-04-01","2020-04-01","ded","DIFFERENCE",null,null,{"$f":"CONCATENATE('Data Entry'!$G$6&\" OF THE \"&'Data Entry'!$C$9&\" \"&'Data Entry'!$L$9)","v":"OFFICE OF THE PRINCIPAL GOVT SENIOR SECONDARY SCHOOL 13DOL,SRI GANGANAGAR"}]
[null,{"$f":"AH10","v":75700},null,null,"HRA",null,"CCA","MARCH CCA","CPF",null,"SURRENDER","surrender  2020-21",null,null,null,null,null,null,null,null,null,null,"2017-10-01","2018-03-01",{"$f":"IF(Salary!$D$11<23001,1450,IF(Salary!$D$11<28001,1625,IF(Salary!$D$11<38501,2100,IF(Salary!$D$11<51501,2850,IF(Salary!$D$11<62001,3575,IF(Salary!$D$11<72001,4200,IF(Salary!$D$11<80001,4800)))))))","v":4800},{"$f":"IF(Salary!$D$11<116001,6150,IF(Salary!$D$11<167001,8900,10500))","v":6150},"UP TO   18000",null,242,265,{"$f":"IF($G$2=\"OPS\",IF(Salary!$AB$6<18001,265,IF(Salary!$AB$6<33501,440,IF(Salary!$AB$6<54001,658,875))),\"\")","v":875},{"$f":"AD4-AC4","v":23},null,null," SALARY STATEMENT FOR FINANCIAL YEAR 2020-21"]
[null,null,"Salary","DA17%",{"$f":"'Data Entry'!E13","v":"Yes"},null,{"$f":"'Data Entry'!E14","v":"No "},{"$f":"IF($R$2=TRUE,$G$7,IF($Y$18=\"State Service\",ROUND($G$7*15/31,0),IF(AND($Y$18=\"Subordinate\",AND(AL8<=9,AL8>=5)),ROUND($G$7/31*22,0),IF(AND($Y$18=\"Subordinate\",$Z$18>9),ROUND($G$7/31*15,0),IF($Y$18=\"Ministrial\",ROUND($G$7/31*22,0),$G$7)))))","v":0},null,null,null,"month","pay","da","total","DEDUCTION",null,null,null,null,null,null,500,1450,null,null,"18001 TO 33500",null,402,440,null,{"$f":"AD5-AC5","v":38}]
[null,"Month",null,null,{"$f":"'Data Entry'!I13","v":0.08},null,{"$f":"'Data Entry'!K14","v":"JODHPUR"},null,"GROSS SALARY",null,null,{"$f":"IF('Data Entry'!C15=\"Yes\",'Data Entry'!$D$15,\"\")","v":8},{"$f":"IF(L6=\"\",0,IF(ISNA(ROUND(VLOOKUP($L$6,Master!$A$7:$D$18,3,0)/2,0)),0,ROUND(VLOOKUP($L$6,Master!$A$7:$D$18,3,0)/2,0)))","v":39000},{"$f":"IF(M6=\"\",\"\",ROUND(M6*17%,0))","v":6630},{"$f":"SUM(M6:N6)","v":45630},"RPMF","GPF1","GPF2","NPS","SI","SI",null,650,1625,null,null,"33501 TO 54000",null,602,658,null,56]
[3,"march",{"$f":"Salary!D10","v":36629},{"$f":"ROUND(C7*17%,0)","v":6227},{"$f":"IF($E$5=\"Yes\",ROUND(C7*$E$6,0),0)","v":2930},null,{"$f":"IFERROR(IF($G$5=\"Yes\",IF('Data Entry'!$K$14=\"\",0,IF(C7>23100,VLOOKUP($G$6,$R$20:$T$24,2,0),VLOOKUP($G$6,$R$20:$T$24,3,0))),0),\"\")","v":0},null,{"$f":"Salary!L10","v":45786},null,null,null,null,null,null,{"$f":"IF(AND($G$2=\"OPS\",AH10>0),IF(AH10<=18000,242,IF(AH10<=33500,402,IF(AH10<=54000,602,800))),0)","v":800},null,null,{"$f":"IF($G$2=\"NPS\",ROUND((C7+D7)*10%,0),R7)","v":0},0,null,null,1100,2100,null,null,"54001 & ABOVE",null,800,875,null,75]
[4,"april",{"$f":"Salary!D11","v":75700},{"$f":"ROUND(C8*17%,0)","v":12869},{"$f":"IF($E$5=\"Yes\",ROUND(C8*$E$6,0),0)","v":6056},null,{"$f":"IFERROR(IF($G$5=\"Yes\",IF('Data Entry'!$K$14=\"\",0,IF(C8>23100,VLOOKUP($G$6,$R$20:$T$24,2,0),VLOOKUP($G$6,$R$20:$T$24,3,0))),0),\"\")","v":0},null,{"$f":"Salary!L11","v":94625},null,null,null,null,null,null,{"$f":"IF(AND($G$2=\"OPS\",AH11>0),IF(AH11<=18000,242,IF(AH11<=33500,402,IF(AH11<=54000,602,800))),0)","v":800},{"$f":"IF(C8>80000,\"6150\",IF(C8>72000,\"4800\",IF(C8>62000,\"4200\",IF(C8>51500,\"3575\",IF(C8>38500,\"2850\",IF(C8>28500,\"2100\",IF(C8>23100,\"1625\",IF(C8>17700,\"1450\",\"0\"))))))))","v":"4800"},{"$f":"IF(C8>167000,\"10500\",IF(C8>116000,\"8900\",Q8))","v":"4800"},{"$f":"IF($G$2=\"NPS\",ROUND((C8+D8)*10%,0),R8)","v":"4800"},{"$f":"AE10","v":7000},null,null,1450,2850,null,null,null,null,null,null,null,null,null,null,"ACP MONTH","pay after acp"]
{"$rows_left_out":93}
{"sheet":"HRA","index":5,"n_rows":19,"n_cols":13,"rows_kept":19,"cut":false,"hidden":false,"merged":[[13,6,13,10],[4,11,5,12],[8,6,8,10],[18,1,19,7],[2,5,2,11],[3,1,3,2],[10,7,10,10],[11,7,11,10],[6,6,6,11],[9,7,9,10],[12,7,12,10],[7,9,7,10]]}
[]
[]
[null,null,null,null,null,"HRA EXEMPTION CALCULATOR"]
[null,"PARTIALY HRA"]
[null,"MONTHS","\"YES\"/NO","PAY+DA","HRA",null,null,null,"CITY TYPE","NON METRO",null,"IF YOU ARE NOT ELIGIBLE TO GET HRA EXEMPTION FOR COMPLETE YEAR THEN CHOOSE PARTIALLY FROM Data Entry SHEET"]
[null,"MARCH 20 ","YES",{"$f":"IF(C6=\"YES\",SUM(Salary!D10:E10),0)","v":42856},{"$f":"IF(C6=\"YES\",Salary!F10,0)","v":2930},null,null,"Choose Metro for Delhi,Mumbai,Chennai,Kolkata and for others Non Metro"]
[null,"APRIL 20","YES",{"$f":"IF(C7=\"YES\",SUM(Salary!D11:E11),0)","v":88569},{"$f":"IF(C7=\"YES\",Salary!F11,0)","v":6056},null,"HRA exempted from income tax ",null,null,null,null,null,{"$f":"'Data Entry'!F17","v":"Yearly"}]
[null,"MAY 20","YES",{"$f":"IF(C8=\"YES\",SUM(Salary!D12:E12),0)","v":88569},{"$f":"IF(C8=\"YES\",Salary!F12,0)","v":6056},null,null,null,null,"वेतन (PAY+DA)",null,{"$f":"IF($M$7=\"Yearly\",Master!E20,\"-\")","v":1038643},{"$f":"IF($M$7=\"Partially\",Master!H20,\"-\")","v":"-"}]
{"$rows_left_out":12}
{"sheet":"NSC INTT","index":6,"n_rows":28,"n_cols":21,"rows_kept":28,"cut":false,"hidden":false,"merged":[[3,19,3,20],[13,1,13,7],[14,1,16,1],[1,0,1,20],[2,1,2,20],[2,0,3,0],[14,10,14,12],[14,13,14,14],[3,1,3,2],[3,3,3,4],[3,5,3,6],[3,7,3,8],[3,9,3,10],[3,11,3,12],[3,13,3,14],[3,15,3,16],[3,17,3,18],[16,9,16,18],[15,4,15,5],[15,2,15,3],[15,6,15,7],[14,2,14,7]]}
[]
["NSC INTEREST CALCULATION\n(GIVE AMOUNT, PERIOD-WISE)"]
["PURCHASE PERIOD","Time of Purchase of NSC-(VIII Issue)"]
[null,"During 2012-13",null,"During 2013-14 to 2015-16",null,"During 01-04-2016 to30-09-2016",null,"During 01-10-2016 to31-03-2017",null,"During 01-04-2017 to30-06-2017",null,"During 01-07-2017 to31-12-2017",null,"During 01-01-2018 to30-09-2018",null,"During 01-10-2018 to30-06-2019",null,"During 01-07-2019 to11-12-2019",null,"During 12-12-2019 to31-03-2020"]
["Period (in years)","Amount","Interest","Amount","Interest","Amount","Interest","Amount","Interest","Amount","Interest","Amount","Interest","Amount","Interest","Amount","Interest","Amount","Interest","Amount","Interest"]
["1st year",null,{"$f":"B6*8.78%","v":0},100,{"$f":"D6*8.68%","v":8.68},null,{"$f":"F6*8.1%","v":0},null,{"$f":"H6*8%","v":0},null,{"$f":"J6*7.9%","v":0},null,{"$f":"L6*7.8%","v":0},null,{"$f":"N6*7.6%","v":0},100,{"$f":"P6*8%","v":8},100,{"$f":"R6*7.9%","v":7.9},100,{"$f":"T6*7.9%","v":7.9}]
["2nd year",null,{"$f":"B7*9.56%","v":0},null,{"$f":"D7*9.43%","v":0},null,{"$f":"F7*8.76%","v":0},null,{"$f":"H7*8.64%","v":0},5000,{"$f":"J7*8.52%","v":426},null,{"$f":"L7*8.41%","v":0},100,{"$f":"N7*8.18%","v":8.18},null,{"$f":"P7*8.64%","v":0},null,{"$f":"R7*8.52%","v":0},null,{"$f":"T7*8.52%","v":0}]
["3rd year",null,{"$f":"B8*10.4%","v":0},null,{"$f":"D8*10.25%","v":0},null,{"$f":"F8*9.46%","v":0},100,{"$f":"H8*9.33%","v":9.33},100,{"$f":"J8*9.2%","v":9.1999999999999993},null,{"$f":"L8*9.06%","v":0},null,{"$f":"N8*8.8%","v":0},null,{"$f":"P8*9.33%","v":0},null,{"$f":"R8*9.2%","v":0},null,{"$f":"T8*9.2%","v":0}]
{"$rows_left_out":21}
{"sheet":"RULES","index":7,"n_rows":129,"n_cols":2,"rows_kept":129,"cut":false,"hidden":false,"merged":[[0,0,0,1]]}
["                  Brief detail of Information and RULES for(Rates,Deductions,Exemption etc.)                                                                             ( Mini Ready Reckoner)"]
[null,"  Select and click any rule to know the brief detail about the taxation Rules & Informations."]
[1,"New Tax  Rates  for Financial-Year 2020-21, Assessment Year 2021-2022 in Old and New Regime"]
[2,"Some  Exempted Receipts / Special allowances &  Perquisite which are not chargable to tax in Old regime"]
[3,"Some Exempted Income ( to be shown while Return filing) "]
[4,"T A X   R U L E S  &  O T H E R   U S E F U L   I N F O R M A T I O N S"]
["I","HRA exemption-u/s 10(13A)"]
["II","Standard deduction u/s 16 (1a) instead of Transport allowance and Medical Reimbursement"]
{"$rows_left_out":121}