{"text_format":"1","workbook":"xlsx","n_sheets":8,"sheets":["Master","Arrear Sheet","Fixation","ACP","Notional","Promotion","HRA","7th pay chart"],"not_rendered":{"charts":0,"images":0,"macros":1,"external_links":0,"defined_names":4,"comments":0,"pivot_tables":0},"unopened":[],"bounds":{"document_bytes":16777216,"sheet_cells":100000,"rows_first":2000,"rows_last":500,"rows_between":2000,"halvings":0,"cell_chars":16384,"cell_head_chars":4096},"cells_cut":0,"cells_raw":0,"read":"whole","date_system":"1900"}

{"sheet":"Master","index":0,"n_rows":28,"n_cols":9,"rows_kept":28,"cut":false,"hidden":false,"merged":[[25,1,25,7],[26,1,26,7],[27,1,27,7],[0,0,0,8],[6,0,6,1],[2,6,2,7],[1,0,1,8],[24,1,24,7],[2,0,2,1],[2,2,2,4],[4,2,4,4],[4,0,4,1],[8,0,8,3],[8,5,8,8]]}
["Principal Government Senior Scondary School, Rooppura"]
["dk;kZy; jktdh; mPp ek/;fed fo|ky;] :iiwjk ¼dqpkeu flVh½"]
["Name Of Employee",null,"Ashwini Kumar",null,null,null,"If GPF Employee select \"NO\"",null,"Yes"]
[]
["Post",null,"Senior Teacher"]
[]
["Type Of Areear",null,"Notional Arrear","From","OCT",2019,"to","FEB",2020]
[]
["To Be Darwn",null,null,null,null,"Already Drawn"]
["Month","Basic","DA Rate","HRA Rate",null,"Month","Basic","DA Rate","HRA Rate"]
{"$rows_left_out":19}
{"sheet":"Arrear Sheet","index":1,"n_rows":26,"n_cols":50,"rows_kept":26,"cut":false,"hidden":false,"merged":[[21,0,21,3],[23,25,23,30],[24,25,24,30],[5,10,6,10],[5,11,6,11],[5,20,5,22],[5,23,5,25],[5,26,5,28],[4,1,6,1],[4,0,6,0],[5,12,6,12],[5,14,5,16],[5,17,5,19],[5,9,6,9],[4,2,4,5],[4,6,4,9],[3,32,11,35],[19,0,19,1],[4,14,4,28],[4,10,4,13],[25,25,25,30],[21,5,21,19],[0,0,0,30],[1,0,1,30],[2,0,2,30],[4,30,6,30],[5,13,6,13],[5,2,6,2],[5,3,6,3],[5,4,6,4],[5,5,6,5],[5,6,6,6],[5,7,6,7],[5,8,6,8],[4,29,6,29]]}
[{"$f":"Master!$A$1","v":"Principal Government Senior Scondary School, Rooppura"}]
[{"$f":"Master!C7&\" \"&Master!D7&\" \"&Master!E7&\" \"&Master!F7&\" \"&Master!G7&\" \"&Master!H7&\" \"&Master!I7","v":"Notional Arrear From OCT 2019 to FEB 2020"}]
[{"$f":"Master!A3&\"-\"&\" \"&Master!C3&\",\"&\" \"&Master!A5&\"-\"&\" \"&Master!C5","v":"Name Of Employee- Ashwini Kumar, Post- Senior Teacher"}]
[null,null,null,null,null,null,null,null,null,null,null,null,null,null,null,null,null,null,null,null,null,null,null,null,null,null,null,null,null,null,null,null,"ftu dkWyEl dh vko';drk ugh gks mUgsa gkbZM dj nsos ,oa ist lsV vi esa izfr'kr c<k ysos A"]
["S.No.","Month","To Be Drawn",null,null,null,"Alread Drawn",null,null,null,"Difference",null,null,null,"Deductions",null,null,null,null,null,null,null,null,null,null,null,null,null,null,"Total Deductions","Net",null,null,null,null,null,null,null,null,null,null,null,null,null,null,null,null,null,null,"JAN"]
[null,null,"Basic","DA","HRA","Total","Basic","DA","HRA","Total","Basic","DA","HRA","Total","NPS",null,null,"GPF",null,null,"SI",null,null,"RPMF",null,null,"ITAX",null,null,null,null,null,null,null,null,null,null,null,null,null,null,null,null,null,null,null,null,null,null,"FEB"]
[null,null,null,null,null,null,null,null,null,null,null,null,null,null,"Due","Drawn","Diff","Due","Drawn","Diff","Due","Drawn","Diff","Due","Drawn","Diff","Due","Drawn","Diff",null,null,null,null,null,null,null,null,null,null,null,null,null,null,null,null,null,null,null,null,"MAR"]
[{"$f":"IF(B8=\"\",\"\",ROWS($A$1:A1))","v":1},"OCT",{"$f":"IFERROR(VLOOKUP(B8,Master!$A$10:$D$22,2,0),0)","v":28567},{"$f":"IFERROR(ROUND(VLOOKUP(B8,Master!$A$10:$D$22,2,0)*VLOOKUP(B8,Master!$A$10:$D$22,3,0),0),0)","v":4856},{"$f":"IFERROR(ROUND(VLOOKUP(B8,Master!$A$10:$D$22,2,0)*VLOOKUP(B8,Master!$A$10:$D$22,4,0),0),0)","v":2285},{"$f":"SUM(C8:E8)","v":35708},{"$f":"IFERROR(VLOOKUP(B8,Master!$F$10:$I$22,2,0),0)","v":18348},{"$f":"IFERROR(ROUND(VLOOKUP(B8,Master!$F$10:$I$22,2,0)*VLOOKUP(B8,Master!$F$10:$I$22,3,0),0),0)","v":0},{"$f":"IFERROR(ROUND(VLOOKUP(B8,Master!$F$10:$I$22,2,0)*VLOOKUP(B8,Master!$F$10:$I$22,4,0),0),0)","v":0},{"$f":"SUM(G8:I8)","v":18348},{"$f":"IFERROR(C8-G8,0)","v":10219},{"$f":"IFERROR(D8-H8,0)","v":4856},{"$f":"IFERROR(E8-I8,0)","v":2285},{"$f":"SUM(K8:M8)","v":17360},{"$f":"IFERROR(ROUND(IF(Master!$I$3=\"YES\",SUM('Arrear Sheet'!C8+'Arrear Sheet'!D8)*10%,\"\"),0),0)","v":3342},{"$f":"IFERROR(ROUND(IF(Master!$I$3=\"YES\",SUM('Arrear Sheet'!G8+'Arrear Sheet'!H8)*10%,\"\"),0),0)","v":1835},{"$f":"IFERROR(O8-P8,0)","v":1507},null,null,{"$f":"R8-S8","v":0},null,null,{"$f":"U8-V8","v":0},null,null,{"$f":"X8-Y8","v":0},null,null,{"$f":"AA8-AB8","v":0},{"$f":"Q8+T8+W8+Z8+AC8","v":1507},{"$f":"N8-AD8","v":15853},null,null,null,null,null,null,null,null,null,null,null,null,null,null,null,null,null,null,"APR"]
[{"$f":"IF(B9=\"\",\"\",ROWS($A$1:A2))","v":2},"NOV",{"$f":"IFERROR(VLOOKUP(B9,Master!$A$10:$D$22,2,0),0)","v":36900},{"$f":"IFERROR(ROUND(VLOOKUP(B9,Master!$A$10:$D$22,2,0)*VLOOKUP(B9,Master!$A$10:$D$22,3,0),0),0)","v":6273},{"$f":"IFERROR(ROUND(VLOOKUP(B9,Master!$A$10:$D$22,2,0)*VLOOKUP(B9,Master!$A$10:$D$22,4,0),0),0)","v":2952},{"$f":"SUM(C9:E9)","v":46125},{"$f":"IFERROR(VLOOKUP(B9,Master!$F$10:$I$22,2,0),0)","v":23700},{"$f":"IFERROR(ROUND(VLOOKUP(B9,Master!$F$10:$I$22,2,0)*VLOOKUP(B9,Master!$F$10:$I$22,3,0),0),0)","v":0},{"$f":"IFERROR(ROUND(VLOOKUP(B9,Master!$F$10:$I$22,2,0)*VLOOKUP(B9,Master!$F$10:$I$22,4,0),0),0)","v":0},{"$f":"SUM(G9:I9)","v":23700},{"$f":"IFERROR(C9-G9,0)","v":13200},{"$f":"IFERROR(D9-H9,0)","v":6273},{"$f":"IFERROR(E9-I9,0)","v":2952},{"$f":"SUM(K9:M9)","v":22425},{"$f":"IFERROR(ROUND(IF(Master!$I$3=\"YES\",SUM('Arrear Sheet'!C9+'Arrear Sheet'!D9)*10%,\"\"),0),0)","v":4317},{"$f":"IFERROR(ROUND(IF(Master!$I$3=\"YES\",SUM('Arrear Sheet'!G9+'Arrear Sheet'!H9)*10%,\"\"),0),0)","v":2370},{"$f":"IFERROR(O9-P9,0)","v":1947},null,null,{"$f":"R9-S9","v":0},null,null,{"$f":"U9-V9","v":0},null,null,{"$f":"X9-Y9","v":0},null,null,{"$f":"AA9-AB9","v":0},{"$f":"Q9+T9+W9+Z9+AC9","v":1947},{"$f":"N9-AD9","v":20478},null,null,null,null,null,null,null,null,null,null,null,null,null,null,null,null,null,null,"MAY"]
[{"$f":"IF(B10=\"\",\"\",ROWS($A$1:A3))","v":3},"DEC",{"$f":"IFERROR(VLOOKUP(B10,Master!$A$10:$D$22,2,0),0)","v":36900},{"$f":"IFERROR(ROUND(VLOOKUP(B10,Master!$A$10:$D$22,2,0)*VLOOKUP(B10,Master!$A$10:$D$22,3,0),0),0)","v":6273},{"$f":"IFERROR(ROUND(VLOOKUP(B10,Master!$A$10:$D$22,2,0)*VLOOKUP(B10,Master!$A$10:$D$22,4,0),0),0)","v":2952},46125,{"$f":"IFERROR(VLOOKUP(B10,Master!$F$10:$I$22,2,0),0)","v":23700},{"$f":"IFERROR(ROUND(VLOOKUP(B10,Master!$F$10:$I$22,2,0)*VLOOKUP(B10,Master!$F$10:$I$22,3,0),0),0)","v":0},{"$f":"IFERROR(ROUND(VLOOKUP(B10,Master!$F$10:$I$22,2,0)*VLOOKUP(B10,Master!$F$10:$I$22,4,0),0),0)","v":0},23700,13200,6273,2952,22425,{"$f":"IFERROR(ROUND(IF(Master!$I$3=\"YES\",SUM('Arrear Sheet'!C10+'Arrear Sheet'!D10)*10%,\"\"),0),0)","v":4317},{"$f":"IFERROR(ROUND(IF(Master!$I$3=\"YES\",SUM('Arrear Sheet'!G10+'Arrear Sheet'!H10)*10%,\"\"),0),0)","v":2370},1947,null,null,0,null,null,0,null,null,0,null,null,0,1947,20478,null,null,null,null,null,null,null,null,null,null,null,null,null,null,null,null,null,null,"JUN"]
{"$rows_left_out":17}
{"sheet":"Fixation","index":2,"n_rows":23,"n_cols":13,"rows_kept":23,"cut":false,"hidden":false,"merged":[[2,12,2,13],[0,0,0,10],[1,0,1,10],[20,7,20,10],[21,7,21,10],[22,7,22,10],[2,0,2,10],[14,0,14,1],[15,0,15,1],[11,7,11,10],[12,7,12,10],[13,7,13,10]]}
[{"$f":"Master!$A$2","v":"dk;kZy; jktdh; mPp ek/;fed fo|ky;] :iiwjk ¼dqpkeu flVh½"}]
["dk;kZy; vkns'k"]
["           Jheku ftyk f'k{kk vf/kdkjh eq[;ky; ek/;fed ukxkSj ds vkns'k Øekad%& ftf'kv@eq-ek@uk@laLFkk&1@osr-fu;fer@2020@702 fnukad%& 08-06-2020 dh vuqikyuk esa Jh jru yky j.koka in dfu\"B lgk;d ds bl fo|ky; esa dfu\"B lgk;d ds in ij dk;Zxzg.k djus dh fnukad 09-03-2018 ls nks o\"kZ dh ifjoh{kk/khu izf'k{k.kkFkhZ dh vof/k fnukad 08-03-2020 dks larks\"kizn :i ls iw.kZ fd;s tkus ij jktLFkku flfoy lsok ¼iqujhf{kr osrueku½ fu;e 2017 esa vafdr izko/kkukuqlkj fnukad 09-03-2020 ls dfu\"B lgk;d ds in dh is&eSfVªd ysoy ,y5 esa U;wure osru :i, 20800 ,oa fu;ekuqlkj vU; HkŸks vkgj.k djus dh Loh—fr ,oa 7th is ds foŸk foHkkx ds uksfVfQds'ku fnukad 30-10-2017 ds fcUnq la[;k 13¼2½ ds vuqlkj fu;fer okf\"kZd osru o`f) dh Loh—fr ,rn}kjk iznku dh tkrh gS%&",null,null,null,null,null,null,null,null,null,null,null,";s vkns'k mnkgj.kkFkZ gS] vki bls vius vuqlkj lq/kkj dj ysos A"]
["Ø-la-","uke dkfeZd","in","tUefrfFk","dk;Z xzg.k frfFk","LFkk;hdj.k frfFk ,oa fu;fer osru J[kyk izkfIr frfFk","Loh—r jfuax is cS.M","is&eSfVªDl ysoy","osru","vkxkeh okf\"kZd osru o`f) fnukad","osru"]
[{"$f":"IF(B5=\"\",\"\",ROWS($A$1:A1))","v":1},{"$f":"Master!C3","v":"Ashwini Kumar"},{"$f":"Master!C5","v":"Senior Teacher"},"2020-01-01",null,null,{"$f":"IFERROR(HLOOKUP(H5,'7th pay chart'!$B$58:$Y$60,2,0)&\"-\"&HLOOKUP(H5,'7th pay chart'!$B$58:$Y$60,3,0),\"\")","v":"20800-65900"},"L-5",{"$f":"IFERROR(HLOOKUP(H5,'7th pay chart'!$B$58:$Y$60,2,0),0)","v":20800},null,{"$f":"IFERROR(MROUND(I5*1.03,100),0)","v":21400}]
[{"$f":"IF(B6=\"\",\"\",ROWS($A$1:A1))","v":""},null,null,null,null,null,{"$f":"IFERROR(HLOOKUP(H6,'7th pay chart'!$B$58:$Y$60,2,0)&\"-\"&HLOOKUP(H6,'7th pay chart'!$B$58:$Y$60,3,0),\"\")","v":""},null,{"$f":"IFERROR(HLOOKUP(H6,'7th pay chart'!$B$58:$Y$60,2,0),0)","v":0},null,{"$f":"IFERROR(MROUND(I6*1.03,100),0)","v":0}]
[{"$f":"IF(B7=\"\",\"\",ROWS($A$1:A2))","v":""},null,null,null,null,null,{"$f":"IFERROR(HLOOKUP(H7,'7th pay chart'!$B$58:$Y$60,2,0)&\"-\"&HLOOKUP(H7,'7th pay chart'!$B$58:$Y$60,3,0),\"\")","v":""},null,{"$f":"IFERROR(HLOOKUP(H7,'7th pay chart'!$B$58:$Y$60,2,0),0)","v":0},null,0]
[{"$f":"IF(B8=\"\",\"\",ROWS($A$1:A3))","v":""},null,null,null,null,null,{"$f":"IFERROR(HLOOKUP(H8,'7th pay chart'!$B$58:$Y$60,2,0)&\"-\"&HLOOKUP(H8,'7th pay chart'!$B$58:$Y$60,3,0),\"\")","v":""},null,{"$f":"IFERROR(HLOOKUP(H8,'7th pay chart'!$B$58:$Y$60,2,0),0)","v":0},null,0]
[{"$f":"IF(B9=\"\",\"\",ROWS($A$1:A4))","v":""},null,null,null,null,null,{"$f":"IFERROR(HLOOKUP(H9,'7th pay chart'!$B$58:$Y$60,2,0)&\"-\"&HLOOKUP(H9,'7th pay chart'!$B$58:$Y$60,3,0),\"\")","v":""},null,{"$f":"IFERROR(HLOOKUP(H9,'7th pay chart'!$B$58:$Y$60,2,0),0)","v":0},null,0]
[{"$f":"IF(B10=\"\",\"\",ROWS($A$1:A5))","v":""},null,null,null,null,null,{"$f":"IFERROR(HLOOKUP(H10,'7th pay chart'!$B$58:$Y$60,2,0)&\"-\"&HLOOKUP(H10,'7th pay chart'!$B$58:$Y$60,3,0),\"\")","v":""},null,{"$f":"IFERROR(HLOOKUP(H10,'7th pay chart'!$B$58:$Y$60,2,0),0)","v":0},null,0]
{"$rows_left_out":14}
{"sheet":"ACP","index":3,"n_rows":27,"n_cols":19,"rows_kept":27,"cut":false,"hidden":false,"merged":[[4,3,5,3],[3,11,3,13],[24,7,24,9],[25,7,25,9],[26,7,26,9],[0,0,0,9],[1,0,1,9],[16,0,16,1],[13,7,13,9],[14,7,14,9],[15,7,15,9],[4,0,5,0],[4,1,5,1],[4,2,5,2],[4,4,5,4],[3,0,3,9],[4,5,4,9]]}
[{"$f":"Master!$A$2","v":"dk;kZy; jktdh; mPp ek/;fed fo|ky;] :iiwjk ¼dqpkeu flVh½"}]
["dk;kZy; vkns'k",null,null,null,null,null,null,null,null,null,null,null,null,null,null,null,null,null,"9 वर्षीय"]
[null,null,null,null,null,null,null,null,null,null,null,null,null,null,null,null,null,null,"18 वर्षीय"]
["        jktLFkku ljdkj foRr foHkkx ds vkns'kkad F15(1)/FD@Rules/2017 t;iqj fnukad 30-10-2017 ds vuqlkj esa jktLFkku flfoy lsok ¼iqujhf{kr osrueku½ fu;e] 2017 f}rh; la’kks/ku ds fu;e 14 ,oa 15 ds rgr Jheku ftyk f'k{kk vf/kdkjh ¼eq[;ky;½ izkjfEHkd f'k{kk-------------------ds vkns'kkad&----------------------------- fnukad%& 05-03-2020 dh vuqikyuk esa bl fo|ky; ds fuEukafdr dkfeZd dk muds uke ds lEeq[k vafdr frfFk ls  ,0 lh0 ih0 ( Assured Career Progression ) dh Lohd`fr iznku fd;s tkus ds QyLo:i fuEukuqlkj osru fu/kkZj.k fd;k tkdj osru vkgj.k djus dh Lohd`fr iznku dh tkrh gS%&",null,null,null,null,null,null,null,null,null,null,";s vkns'k mnkgj.kkFkZ gS] vki bls vius vuqlkj lq/kkj dj ysos A",null,null,null,null,null,null,"27 वर्षीय"]
["Ø-la-","uke deZpkjh o in uke","fu;fer fu;qfDr frfFk","orZeku is eSfVªd ysoy","orZeku ewy osru","Lohd`r ,0 lh0 ih0 esa osru fu/kkZj.k",null,null,null,null,null,null,null,null,null,null,null,null,"20 वर्षीय"]
[null,null,null,null,null,"Lskok vof/k o\"kksZ esa ,oa ns; ,lhih",",lhih Lohd`fr dh fnukad",",lhih esa Lohd`r ysoy la[;k","fu/kkZfjr  osru","vkxkeh osru o`f} frfFk",null,null,null,null,null,null,null,null,"30 वर्षीय"]
[{"$f":"IF(B7=\"\",\"\",ROWS($A$1:A1))","v":""},null,null,"L-1",null,null,null,"L-1",null,null,null,null,null,null,null,null,null,null,"से प्रथम ACP"]
[{"$f":"IF(B8=\"\",\"\",ROWS($A$1:A2))","v":""},null,null,null,null,null,null,null,null,null,null,null,null,null,null,null,null,null,"से द्वितीय ACP"]
[{"$f":"IF(B9=\"\",\"\",ROWS($A$1:A3))","v":""},null,null,null,null,null,null,null,null,null,null,null,null,null,null,null,null,null,"से तृतीय ACP"]
[{"$f":"IF(B10=\"\",\"\",ROWS($A$1:A4))","v":""}]
{"$rows_left_out":18}
{"sheet":"Notional","index":4,"n_rows":28,"n_cols":10,"rows_kept":28,"cut":false,"hidden":false,"merged":[[13,4,13,7],[14,4,14,7],[25,4,25,7],[26,4,26,7],[27,4,27,7],[1,9,2,10],[21,5,21,7],[22,5,22,7],[23,5,23,7],[16,0,16,4],[16,5,16,7],[12,4,12,7],[9,0,9,2],[9,3,9,4],[9,6,9,7],[10,0,10,2],[10,3,10,4],[10,6,10,7],[7,0,7,2],[7,3,7,4],[7,6,7,7],[8,0,8,2],[8,3,8,4],[8,6,8,7],[4,0,4,1],[4,2,4,3],[4,4,4,5],[4,6,4,7],[5,0,5,7],[6,0,6,2],[6,3,6,4],[6,6,6,7],[0,0,0,7],[1,0,1,7],[2,0,2,7],[3,0,3,1],[3,2,3,3],[3,4,3,5],[3,6,3,7]]}
[{"$f":"Master!$A$2","v":"dk;kZy; jktdh; mPp ek/;fed fo|ky;] :iiwjk ¼dqpkeu flVh½"}]
["dk;kZy; vkns'k",null,null,null,null,null,null,null,null,";s vkns'k mnkgj.kkFkZ gS] vki bls vius vuqlkj lq/kkj dj ysos A"]
["         ekuuh; mPp U;k;ky; tks/kiqj@t;iqj ds fu.kZ;kuqlkj r`rh; Js.kh izkFkfed vksj mPp izkFkfed fo|ky; v/;kid HkrhZ a 2013 ds vUrxZr la'kksf/kr ,oa iqu% la'kksf/kr ifj.kke ls p;uksijkUr f'k{kdksa dks uks'kuy ifjykHk gsrq ikfjr fu.kZ; ds ikyukFkZ Jheku ofj\"B fof/k ijke'khZ izkjfEHkd f'k{kk ¼fof/k izdks\"B½ jktLFkku t;iqj ds i=kad i-18¼279½ izk-f'k@fo-iz-@18@t;iqj fnukad 20-11-2018 dh vuqikyuk esa Jheku~ ftyk f'k{kk vf/kdkjh ¼eq[;ky;½ izkjfEHkd f'k{kk -------------- ds vkns'k Øekad -------------------- fnukad ----------------- ds vuqlkj ¼uke deZpkjh ,oa inLFkiu LFkku fy[ksa½] okLrfod izFke dk;Zxzg.k frfFk ----------------------------------dks ekuuh; U;k;ky; ds fu.kZ;kuqlkj uks'kuy@ofj\"Brk ifjykHk gsrq fu/kkZfjr frfFk ¼izFke ifj.kke fu;qDr f'k{kdks dh dk;Zxzg.k frfFk½ ------------------ ls uks'kuy ifjykHk gsrq LFkk;hdj.k frfFk ------------------------ djus ,oa Jheku~ ftyk f'k{kk vf/kdkjh ¼eq[;ky;½ izkjfEHkd f'k{kk---------------- ds vkns'k Øekad----------------------------------------- fnukad------------------------ ds vuqlkj fnukad-------------------- dks LFkk;hdj.k fd;s tkus ij fuEukuqlkj osru fu/kkZj.k fd;k tkrk gS %&"]
["okLrfod izFke dk;Zxzg.k frfFk 07-10-2017 ¼e/;kà iwoZ½ ij ns; osru",null,"ekuuh; U;k;ky; ds fu.kZ;kuqlkj uks'kuy ifjykHk gsrq fu/kkZfjr frfFk 15-04-2015 dks ns; osru",null,"ekuuh; U;k;ky; ds fu.kZ;kuqlkj uks'kuy ifjykHk gsrq LFkk;hdj.k frfFk 15-04-2017 dks ns; osru",null,"okLrfod LFkk;hdj.k frfFk 07-10-2019 dks ns; osru"]
["23700 FIX",null,"23700 FIX ¼uks'kuy½",null,"33800 ¼uks'kuy½",null,36900]
["fnukad 15-04-2017 ls fnukad 07-10-2019 ds e/; ns; ¼uks'kuy½ okf\"kZd osru o`f);ksa dk fooj.k"]
["okf\"kZd osru o`f) frfFk",null,null,"osru o`f) frfFk dks ns; osru",null,"YkkHk dk izdkj","fo-fooj.k"]
["01.07.2017",null,null,34800,null,"uks'kuy","okf\"kZd osru o`f)"]
["01.07.2018",null,null,35800,null,"uks'kuy","okf\"kZd osru o`f)"]
["01.07.2019",null,null,36900,null,"uks'kuy","okf\"kZd osru o`f)"]
{"$rows_left_out":19}
{"sheet":"Promotion","index":5,"n_rows":28,"n_cols":13,"rows_kept":28,"cut":false,"hidden":false,"merged":[[27,8,27,10],[14,8,14,10],[15,8,15,10],[16,8,16,10],[17,0,17,1],[25,8,25,10],[26,8,26,10],[5,12,8,13],[0,0,0,10],[1,0,1,10],[2,0,2,10],[3,0,3,10],[5,3,5,4],[5,6,5,8],[5,5,6,5],[5,0,6,0],[5,1,6,1],[5,2,6,2],[5,9,6,9],[5,10,6,10]]}
[{"$f":"Master!$A$2","v":"dk;kZy; jktdh; mPp ek/;fed fo|ky;] :iiwjk ¼dqpkeu flVh½"}]
["dk;kZy; vkns'k"]
[]
["                 Jheku mifuns'kd ek/;fed f'k{kk] vtesj e.My vtesj ds vkns'kkad%& -------------------------- fnukad%& o xfBr foHkkxh; inksUUkfr lfefr dh vfHk'ka\"kkuqlkj Jh ---------------------------- r`rh; osru J`[kayk ls ofj\"B v/;kid ¼fo\"k;&-----½ in ij inksUufr mijkUr inLFkkiUu LFkkuh; fo|ky; es fd;s tkus ij jktLFkku flfoy lsok ¼iqujhf{kr osrueku½ fu;e 2017 ds vuqlkj lkros osrueku dh iS esfVªDl ysoy&00 ls ysoy&01 es fuEukuqlkj osru fu;ru fd;k tkrk gS%&"]
[]
["Ø-la-","uke deZpkjh","in","r`rh; osru J`[kyk esa ns; osru",null,"f}rh; osru J`[kyk esa dk;Zxzg.k frfFk","f}rh; osru J`[kyk esa osru fu/kkZj.k i'pkr~ ns; osru",null,null,"vkxkeh osru o`f}","fofo",null,";s vkns'k mnkgj.kkFkZ gS] vki bls vius vuqlkj lq/kkj dj ysos A"]
[null,null,null,"ysoy","ewy osru",null,"ns; frfFk","ysoy","fu;r osru"]
[{"$f":"IF(B8=\"\",\"\",ROWS($A$1:A1))","v":""}]
[{"$f":"IF(B9=\"\",\"\",ROWS($A$1:A2))","v":""}]
[{"$f":"IF(B10=\"\",\"\",ROWS($A$1:A3))","v":""}]
{"$rows_left_out":19}
{"sheet":"HRA","index":6,"n_rows":28,"n_cols":9,"rows_kept":28,"cut":false,"hidden":false,"merged":[[3,8,6,9],[27,5,27,6],[4,0,5,0],[4,1,5,1],[4,2,5,2],[4,3,5,3],[4,4,5,4],[4,5,5,5],[16,0,16,1],[25,5,25,6],[26,5,26,6],[0,0,0,6],[1,0,1,6],[2,0,2,7],[3,0,3,6],[13,5,13,6],[14,5,14,6],[15,5,15,6]]}
[{"$f":"Master!$A$2","v":"dk;kZy; jktdh; mPp ek/;fed fo|ky;] :iiwjk ¼dqpkeu flVh½"}]
["dk;kZy; vkns'k"]
[]
["                fuEufyf[kr dkfeZdks dks muds }kjk çLrqr vkosnu i= ds vkèkkj ij jktLFkku ljdkj ds vkns'k Øekad: ,Q-6 ¼4½ ,Q- Mh-@:Yl@07  fnuk¡d& 12-09-2008 fnuk¡d 06-02-2009 ¼la'kksfèkr nj½ ,oa jktLFkku flfoy lsok ¼iqujhf{kr osrueku ½ 2017 ds foÙk foHkkx ds vkns'kkad ,Q-Mh-15¼1½ ,Q-Mh-@¼:Yl½ 2017 t;iqj fnukad 31&10&2017 ,oa lela[;d la'kksfèkr vkns'k fnukad 09&12&2017 ds çkoèkkukuqlkj jktLFkku lsok fu;eksa ds fu;e 7 ¼24½¼1½ esa ifjHkkf\"kr osru ds fu;ekuqlkj edku fdjk;k HkÙkk  muds uke ds lkeus vafdr fnuk¡d ls jktLFkku ljdkj ds vkns'kkuqlkj Loh—r fd;k tkrk gS&",null,null,null,null,null,null,null,";s vkns'k mnkgj.kkFkZ gS] vki bls vius vuqlkj lq/kkj dj ysos A"]
["Ø-l-","uke dkfeZd","in","ysoy","edku fdjk;k HkÙkk ns; frfFk","ewy osru","edku fdjk;k HkÙkk"]
[null,null,null,null,null,null,0.08]
[{"$f":"IF(B7=\"\",\"\",ROWS($A$1:A1))","v":1},"Jh jru yky j.koka",null,"L-5",null,20800,{"$f":"ROUND(F7*G6,0)","v":1664}]
[{"$f":"IF(B8=\"\",\"\",ROWS($A$1:A2))","v":""}]
[{"$f":"IF(B9=\"\",\"\",ROWS($A$1:A3))","v":""}]
[{"$f":"IF(B10=\"\",\"\",ROWS($A$1:A4))","v":""}]
{"$rows_left_out":19}
{"sheet":"7th pay chart","index":7,"n_rows":60,"n_cols":25,"rows_kept":60,"cut":false,"hidden":false,"merged":[[0,1,0,9],[0,10,0,13],[0,14,0,21],[0,22,0,24]]}
["Existing\nR.P.Band","PB-1\n5200-20200",null,null,null,null,null,null,null,null,"PB-2\n9300-34800",null,null,null,"PB-3\n15600-39100",null,null,null,null,null,null,null,"PB-4\n37400-67000"]
["Exist.G.P.",1700,1750,1900,2000,2400,2400,2400,2800,2800,3600,4200,4800,5400,5400,6000,6600,6800,7200,7600,8200,8700,8900,9500,10000]
["Exist.G.P.No",2,3,4,5,9,"9A","9B",10,"10A",11,12,14,15,15,16,17,18,19,20,21,22,23,"23A",24]
["Levels →","L-1","L-2","L-3","L-4","L-5","L-6","L-7","L-8","L-9","L-10","L-11","L-12","L-13","L-14","L-15","L-16","L-17","L-18","L-19","L-20","L-21","L-22","L-23","L-24"]
["Cell No. ↓",1,2,3,4,5,6,7,8,9,10,11,12,13,14,15,16,17,18,19,20,21,22,23,24]
[1,17700,17900,18200,19200,20800,21500,22400,26300,28700,33800,37800,44300,53100,56100,60700,67300,71000,75300,79900,88900,123100,129700,145800,148800]
[2,18200,18400,18700,19800,21400,22100,23100,27100,29600,34800,38900,45600,54700,57800,62500,69300,73100,77600,82300,91600,126800,133600,150200,153300]
[3,18700,19000,19300,20400,22000,22800,23800,27900,30500,35800,40100,47000,56300,59500,64400,71400,75300,79900,84800,94300,130600,137600,154700,157900]
[4,19300,19600,19900,21000,22700,23500,24500,28700,31400,36900,41300,48400,58000,61300,66300,73500,77600,82300,87300,97100,134500,141700,159300,162600]
[5,19900,20200,20500,21600,23400,24200,25200,29600,32300,38000,42500,49900,59700,63100,68300,75700,79900,84800,89900,100000,138500,146000,164100,167500]
{"$rows_left_out":50}